{"text_format":"1","workbook":"xlsx","n_sheets":14,"sheets":["Systems Request","MPS_CVL NG","Internal Systems Request","Coverall 1","Coverall 2","Coverall 3","Coverall 4","Coverall 5","Coverall 6","Coverall 7","Coverall 8","Coverall 9","Coverall 10","Dropdowns"],"not_rendered":{"charts":0,"images":3,"macros":1,"external_links":0,"defined_names":1,"comments":0,"pivot_tables":0},"unopened":[],"bounds":{"document_bytes":16777216,"sheet_cells":100000,"rows_first":2000,"rows_last":500,"rows_between":2000,"halvings":0,"cell_chars":16384,"cell_head_chars":4096},"cells_cut":0,"cells_raw":0,"read":"whole","date_system":"1900"}

{"sheet":"Systems Request","index":0,"n_rows":38,"n_cols":23,"rows_kept":38,"cut":false,"hidden":false,"merged":[[1,15,3,19],[12,2,12,6],[13,2,13,6],[9,16,9,17],[10,16,10,17],[8,7,8,14],[9,7,9,14],[10,7,10,14],[11,7,11,14],[12,7,12,14],[13,7,13,14],[8,2,8,6],[9,2,9,6],[10,2,10,6],[12,16,12,17],[6,0,6,21],[37,2,37,20],[20,17,23,17],[11,2,11,6],[16,2,16,21],[8,19,8,20],[36,2,36,20],[21,12,23,12],[21,7,23,7],[21,8,23,8],[21,9,23,9],[21,2,23,2],[21,3,23,3],[21,4,23,4],[21,15,23,15],[7,2,7,14],[7,16,7,18],[5,0,5,21],[35,2,35,20],[16,0,16,1],[21,5,23,5],[21,6,23,6],[20,16,23,16],[4,20,4,21],[21,10,23,10],[21,11,23,11],[21,14,23,14],[21,13,23,13],[8,16,8,17],[11,16,11,17],[20,18,23,18],[20,19,23,19],[20,20,23,20],[20,21,23,21],[19,16,19,21],[20,2,20,15]]}
[]
[null,null,null,null,null,null,null,null,null,null,null,null,null,null,null,"Systems Request"]
[]
[]
[null,null,null,null,null,null,null,null,null,null,null,null,null,null,null,null,null,null,null,null,"Please fill out all necessary fields, save a copy for your records, and send the original to AIG Broker Services at  ToServe@AIG.com\n\nIf you are requesting MPS/CoverAll, the subject line should have \"MPS / CoverAll\" noted"]
[]
[]
[null,null,"MUST BE COMPLETED",null,null,null,null,null,null,null,null,null,null,null,null,null,"MUST BE COMPLETED"]
{"$rows_left_out":31}
{"sheet":"MPS_CVL NG","index":1,"n_rows":47,"n_cols":11,"rows_kept":47,"cut":false,"hidden":false,"merged":[]}
[]
[]
[]
[]
["Name","Select MPS Role-See below for Role Descriptions","Optional Underwriter ID?","User's Manager or Program Manager","For \"View Only\" Role","If Source is \"other\" Identify Source","SELECT \nMPS / CVL NG","User Requires Access to Production, Model or Both","Business Justification for Access Granted","Grant Access to Producer Number","Enter Additional Producer Numbers if Needed"]
[{"$f":"IF('Systems Request'!G25=\"X\",'Systems Request'!Q25&\" \" & 'Systems Request'!S25&\" \" &'Systems Request'!R25,\"\")","v":""},{"$f":"IF(A6<>\"\",\"Select Role\",\"\")","v":""},{"$f":"IF(B6=\"Underwriter Assistant\",\"Select Yes or No\",\"\")","v":""},null,{"$f":"IF(A6<>\"\",\"Select Source\",\"\")","v":""},{"$f":"IF(E6=\"Other\",\"Enter Source\",\"NA\")","v":"NA"},null,{"$f":"IF(A6<>\"\",\"Select Access\",\"\")","v":""},null,{"$f":"IF('Systems Request'!G25=\"X\",'Systems Request'!S10,\"\")","v":""}]
[{"$f":"IF('Systems Request'!G26=\"X\",'Systems Request'!Q26&\" \" & 'Systems Request'!S26&\" \" &'Systems Request'!R26,\"\")","v":""},{"$f":"IF(A7<>\"\",\"Select Role\",\"\")","v":""},{"$f":"IF(B7=\"Underwriter Assistant\",\"Select Yes or No\",\"\")","v":""},null,{"$f":"IF(A7<>\"\",\"Select Source\",\"\")","v":""},{"$f":"IF(E7=\"Other\",\"Enter Source\",\"NA\")","v":"NA"},{"$f":"IF(A7<>\"\",\"Select MPS/CVL NG Version\",\"\")","v":""},"",null,{"$f":"IF('Systems Request'!G26=\"X\",'Systems Request'!S10,\"\")","v":""}]
[{"$f":"IF('Systems Request'!G27=\"X\",'Systems Request'!Q27&\" \" & 'Systems Request'!S27&\" \" &'Systems Request'!R27,\"\")","v":""},{"$f":"IF(A8<>\"\",\"Select Role\",\"\")","v":""},"",null,"","NA","","",{"$f":"IF(A8<>\"\",\"Enter Business Justification\",\"\")","v":""},{"$f":"IF('Systems Request'!G27=\"X\",'Systems Request'!S10,\"\")","v":""}]
{"$rows_left_out":40}
{"sheet":"Internal Systems Request","index":2,"n_rows":30,"n_cols":29,"rows_kept":30,"cut":false,"hidden":true,"merged":[[1,3,3,3],[1,0,3,0],[1,1,3,1],[0,17,3,17],[0,18,3,18],[1,4,3,4],[1,5,3,5],[0,13,3,13],[0,14,3,14],[1,12,3,12],[1,10,3,10],[0,0,0,12],[0,16,3,16],[1,2,3,2],[0,28,3,28],[0,19,3,19],[0,20,3,20],[1,6,3,6],[0,22,3,22],[1,8,3,8],[0,24,3,24],[1,7,3,7],[0,21,3,21],[1,9,3,9],[0,23,3,23],[0,15,3,15],[1,11,3,11],[0,26,3,26],[0,27,3,27],[0,25,3,25]]}
["Systems Requested",null,null,null,null,null,null,null,null,null,null,null,null,"Last Name","First Name","Middle Initial","Job Function","National Producer Number","States Licensed","Brokerage","Address1","Address2","City","State","Postal Code","Phone #","Internet Address","Producer \nCode","Mainframe ID"]
["ALIR - DMV","E-Start","ODEN PT","MVR","MPS/CVL NG","Intellirisk","ISO SPI Plus","Mainframe","Marshall & Swift","Risk Meter","NOR (Online\nRegistries &\nMotor Carrier)","E-Delivery","PA Portal"]
[]
[]
[{"$f":"IF('Systems Request'!C25<>\"\",'Systems Request'!C25,\"\")","v":""},{"$f":"IF('Systems Request'!D25<>\"\",'Systems Request'!D25,\"\")","v":""},{"$f":"IF('Systems Request'!E25<>\"\",'Systems Request'!E25,\"\")","v":""},{"$f":"IF('Systems Request'!F25<>\"\",'Systems Request'!F25,\"\")","v":""},{"$f":"IF('Systems Request'!G25<>\"\",'Systems Request'!G25,\"\")","v":""},{"$f":"IF('Systems Request'!M25<>\"\",'Systems Request'!M25,\"\")","v":""},{"$f":"IF('Systems Request'!H25<>\"\",'Systems Request'!H25,\"\")","v":""},{"$f":"IF('Systems Request'!I25<>\"\",'Systems Request'!I25,\"\")","v":""},{"$f":"IF('Systems Request'!J25<>\"\",'Systems Request'!J25,\"\")","v":""},{"$f":"IF('Systems Request'!K25<>\"\",'Systems Request'!K25,\"\")","v":""},{"$f":"IF('Systems Request'!L25<>\"\",'Systems Request'!L25,\"\")","v":""},{"$f":"IF('Systems Request'!O25<>\"\",'Systems Request'!O25,\"\")","v":""},{"$f":"IF('Systems Request'!N25<>\"\",'Systems Request'!N25,\"\")","v":""},{"$f":"IF('Systems Request'!R25<>\"\",'Systems Request'!R25,\"\")","v":""},{"$f":"IF('Systems Request'!Q25<>\"\",'Systems Request'!Q25,\"\")","v":""},{"$f":"IF('Systems Request'!S25<>\"\",'Systems Request'!S25,\"\")","v":""},{"$f":"IF('Systems Request'!T25<>\"\",'Systems Request'!T25,\"\")","v":"Select Job Function"},{"$f":"IF('Systems Request'!Q25<>\"\",'Systems Request'!S$9,\"\")","v":""},{"$f":"IF('Systems Request'!Q25<>\"\",'Systems Request'!$S$11,\"\")","v":""},{"$f":"IF('Systems Request'!Q25<>\"\",'Systems Request'!$H$9,\"\")","v":""},{"$f":"IF('Systems Request'!Q25<>\"\",'Systems Request'!$H$10,\"\")","v":""},{"$f":"IF('Systems Request'!Q25<>\"\",'Systems Request'!$H$11,\"\")","v":""},{"$f":"IF('Systems Request'!Q25<>\"\",'Systems Request'!$H$12,\"\")","v":""},{"$f":"IF('Systems Request'!Q25<>\"\",'Systems Request'!$H$13,\"\")","v":""},{"$f":"IF('Systems Request'!Q25<>\"\",'Systems Request'!$H$14,\"\")","v":""},{"$f":"IF('Systems Request'!Q25<>\"\",'Systems Request'!$U$25,\"\")","v":""},{"$f":"IF('Systems Request'!Q25<>\"\",'Systems Request'!$V$25,\"\")","v":""},{"$f":"IF('Systems Request'!Q25<>\"\",'Systems Request'!$R$10,\"\")","v":""},{"$f":"IF('Systems Request'!Q25<>\"\",\"Assign Mainframe ID\",\"\")","v":""}]
[{"$f":"IF('Systems Request'!C26<>\"\",'Systems Request'!C26,\"\")","v":""},{"$f":"IF('Systems Request'!D26<>\"\",'Systems Request'!D26,\"\")","v":""},{"$f":"IF('Systems Request'!E26<>\"\",'Systems Request'!E26,\"\")","v":""},{"$f":"IF('Systems Request'!F26<>\"\",'Systems Request'!F26,\"\")","v":""},{"$f":"IF('Systems Request'!G26<>\"\",'Systems Request'!G26,\"\")","v":""},{"$f":"IF('Systems Request'!M26<>\"\",'Systems Request'!M26,\"\")","v":""},{"$f":"IF('Systems Request'!H26<>\"\",'Systems Request'!H26,\"\")","v":""},{"$f":"IF('Systems Request'!I26<>\"\",'Systems Request'!I26,\"\")","v":""},{"$f":"IF('Systems Request'!J26<>\"\",'Systems Request'!J26,\"\")","v":""},{"$f":"IF('Systems Request'!K26<>\"\",'Systems Request'!K26,\"\")","v":""},{"$f":"IF('Systems Request'!L26<>\"\",'Systems Request'!L26,\"\")","v":""},{"$f":"IF('Systems Request'!O26<>\"\",'Systems Request'!O26,\"\")","v":""},{"$f":"IF('Systems Request'!N26<>\"\",'Systems Request'!N26,\"\")","v":""},{"$f":"IF('Systems Request'!R26<>\"\",'Systems Request'!R26,\"\")","v":""},{"$f":"IF('Systems Request'!Q26<>\"\",'Systems Request'!Q26,\"\")","v":""},{"$f":"IF('Systems Request'!S26<>\"\",'Systems Request'!S26,\"\")","v":""},{"$f":"IF('Systems Request'!T26<>\"\",'Systems Request'!T26,\"\")","v":"Select Job Function"},{"$f":"IF('Systems Request'!Q26<>\"\",'Systems Request'!S$9,\"\")","v":""},{"$f":"IF('Systems Request'!Q26<>\"\",'Systems Request'!$S$11,\"\")","v":""},{"$f":"IF('Systems Request'!Q26<>\"\",'Systems Request'!$H$9,\"\")","v":""},{"$f":"IF('Systems Request'!Q26<>\"\",'Systems Request'!$H$10,\"\")","v":""},{"$f":"IF('Systems Request'!Q26<>\"\",'Systems Request'!$H$11,\"\")","v":""},{"$f":"IF('Systems Request'!Q26<>\"\",'Systems Request'!$H$12,\"\")","v":""},{"$f":"IF('Systems Request'!Q26<>\"\",'Systems Request'!$H$13,\"\")","v":""},{"$f":"IF('Systems Request'!Q26<>\"\",'Systems Request'!$H$14,\"\")","v":""},{"$f":"IF('Systems Request'!Q26<>\"\",'Systems Request'!$U$26,\"\")","v":""},{"$f":"IF('Systems Request'!Q26<>\"\",'Systems Request'!$V$26,\"\")","v":""},{"$f":"IF('Systems Request'!Q26<>\"\",'Systems Request'!$R$10,\"\")","v":""},{"$f":"IF('Systems Request'!Q26<>\"\",\"Assign Mainframe ID\",\"\")","v":""}]
[{"$f":"IF('Systems Request'!C27<>\"\",'Systems Request'!C27,\"\")","v":""},{"$f":"IF('Systems Request'!D27<>\"\",'Systems Request'!D27,\"\")","v":""},{"$f":"IF('Systems Request'!E27<>\"\",'Systems Request'!E27,\"\")","v":""},{"$f":"IF('Systems Request'!F27<>\"\",'Systems Request'!F27,\"\")","v":""},{"$f":"IF('Systems Request'!G27<>\"\",'Systems Request'!G27,\"\")","v":""},{"$f":"IF('Systems Request'!M27<>\"\",'Systems Request'!M27,\"\")","v":""},{"$f":"IF('Systems Request'!H27<>\"\",'Systems Request'!H27,\"\")","v":""},{"$f":"IF('Systems Request'!I27<>\"\",'Systems Request'!I27,\"\")","v":""},{"$f":"IF('Systems Request'!J27<>\"\",'Systems Request'!J27,\"\")","v":""},{"$f":"IF('Systems Request'!K27<>\"\",'Systems Request'!K27,\"\")","v":""},{"$f":"IF('Systems Request'!L27<>\"\",'Systems Request'!L27,\"\")","v":""},{"$f":"IF('Systems Request'!O27<>\"\",'Systems Request'!O27,\"\")","v":""},{"$f":"IF('Systems Request'!N27<>\"\",'Systems Request'!N27,\"\")","v":""},{"$f":"IF('Systems Request'!R27<>\"\",'Systems Request'!R27,\"\")","v":""},{"$f":"IF('Systems Request'!Q27<>\"\",'Systems Request'!Q27,\"\")","v":""},{"$f":"IF('Systems Request'!S27<>\"\",'Systems Request'!S27,\"\")","v":""},{"$f":"IF('Systems Request'!T27<>\"\",'Systems Request'!T27,\"\")","v":"Select Job Function"},{"$f":"IF('Systems Request'!Q27<>\"\",'Systems Request'!S$9,\"\")","v":""},{"$f":"IF('Systems Request'!Q27<>\"\",'Systems Request'!$S$11,\"\")","v":""},{"$f":"IF('Systems Request'!Q27<>\"\",'Systems Request'!$H$9,\"\")","v":""},{"$f":"IF('Systems Request'!Q27<>\"\",'Systems Request'!$H$10,\"\")","v":""},{"$f":"IF('Systems Request'!Q27<>\"\",'Systems Request'!$H$11,\"\")","v":""},{"$f":"IF('Systems Request'!Q27<>\"\",'Systems Request'!$H$12,\"\")","v":""},{"$f":"IF('Systems Request'!Q27<>\"\",'Systems Request'!$H$13,\"\")","v":""},{"$f":"IF('Systems Request'!Q27<>\"\",'Systems Request'!$H$14,\"\")","v":""},{"$f":"IF('Systems Request'!Q27<>\"\",'Systems Request'!$U$27,\"\")","v":""},{"$f":"IF('Systems Request'!Q27<>\"\",'Systems Request'!$V$27,\"\")","v":""},{"$f":"IF('Systems Request'!Q27<>\"\",'Systems Request'!$R$10,\"\")","v":""},{"$f":"IF('Systems Request'!Q27<>\"\",\"Assign Mainframe ID\",\"\")","v":""}]
[{"$f":"IF('Systems Request'!C28<>\"\",'Systems Request'!C28,\"\")","v":""},{"$f":"IF('Systems Request'!D28<>\"\",'Systems Request'!D28,\"\")","v":""},{"$f":"IF('Systems Request'!E28<>\"\",'Systems Request'!E28,\"\")","v":""},{"$f":"IF('Systems Request'!F28<>\"\",'Systems Request'!F28,\"\")","v":""},{"$f":"IF('Systems Request'!G28<>\"\",'Systems Request'!G28,\"\")","v":""},{"$f":"IF('Systems Request'!M28<>\"\",'Systems Request'!M28,\"\")","v":""},{"$f":"IF('Systems Request'!H28<>\"\",'Systems Request'!H28,\"\")","v":""},{"$f":"IF('Systems Request'!I28<>\"\",'Systems Request'!I28,\"\")","v":""},{"$f":"IF('Systems Request'!J28<>\"\",'Systems Request'!J28,\"\")","v":""},{"$f":"IF('Systems Request'!K28<>\"\",'Systems Request'!K28,\"\")","v":""},{"$f":"IF('Systems Request'!L28<>\"\",'Systems Request'!L28,\"\")","v":""},{"$f":"IF('Systems Request'!O28<>\"\",'Systems Request'!O28,\"\")","v":""},{"$f":"IF('Systems Request'!N28<>\"\",'Systems Request'!N28,\"\")","v":""},{"$f":"IF('Systems Request'!R28<>\"\",'Systems Request'!R28,\"\")","v":""},{"$f":"IF('Systems Request'!Q28<>\"\",'Systems Request'!Q28,\"\")","v":""},{"$f":"IF('Systems Request'!S28<>\"\",'Systems Request'!S28,\"\")","v":""},{"$f":"IF('Systems Request'!T28<>\"\",'Systems Request'!T28,\"\")","v":"Select Job Function"},{"$f":"IF('Systems Request'!Q28<>\"\",'Systems Request'!S$9,\"\")","v":""},{"$f":"IF('Systems Request'!Q28<>\"\",'Systems Request'!$S$11,\"\")","v":""},{"$f":"IF('Systems Request'!Q28<>\"\",'Systems Request'!$H$9,\"\")","v":""},{"$f":"IF('Systems Request'!Q28<>\"\",'Systems Request'!$H$10,\"\")","v":""},{"$f":"IF('Systems Request'!Q28<>\"\",'Systems Request'!$H$11,\"\")","v":""},{"$f":"IF('Systems Request'!Q28<>\"\",'Systems Request'!$H$12,\"\")","v":""},{"$f":"IF('Systems Request'!Q28<>\"\",'Systems Request'!$H$13,\"\")","v":""},{"$f":"IF('Systems Request'!Q28<>\"\",'Systems Request'!$H$14,\"\")","v":""},{"$f":"IF('Systems Request'!Q28<>\"\",'Systems Request'!$U$28,\"\")","v":""},{"$f":"IF('Systems Request'!Q28<>\"\",'Systems Request'!$V$28,\"\")","v":""},{"$f":"IF('Systems Request'!Q28<>\"\",'Systems Request'!$R$10,\"\")","v":""},{"$f":"IF('Systems Request'!Q28<>\"\",\"Assign Mainframe ID\",\"\")","v":""}]
{"$rows_left_out":23}
{"sheet":"Coverall 1","index":3,"n_rows":27,"n_cols":9,"rows_kept":27,"cut":false,"hidden":true,"merged":[[26,2,26,4],[26,6,26,8],[20,2,21,8],[22,2,22,8],[23,2,23,4],[23,6,23,8],[25,2,25,4],[25,6,25,8],[24,2,24,4],[24,6,24,8],[17,2,17,4],[17,6,17,8],[18,2,18,4],[18,6,18,8],[19,2,19,4],[14,2,14,4],[14,6,14,8],[15,2,15,4],[15,6,15,8],[16,2,16,4],[16,6,16,8],[13,2,13,4],[13,6,13,8],[7,2,7,4],[4,6,4,8],[5,6,5,8],[6,6,6,8],[7,6,7,8],[8,2,9,8],[6,2,6,4],[10,2,10,8],[11,2,11,4],[11,6,11,8],[12,2,12,4],[12,6,12,8],[2,2,2,8],[3,2,3,4],[3,6,3,8],[4,2,4,4],[5,2,5,4]]}
[]
[]
[null,null,"Lexington MPS/CVL NG User Request Form"]
[null,null,"Request Type",null,null,null,"Add User"]
[null,null,"Request Date",null,null,null,{"$f":"'Systems Request'!$S$12","v":"00:00:00"}]
[null,null,"Request By (Must be user's manager)",null,null,null,{"$f":"'MPS_CVL NG'!$D$6","v":0}]
[null,null,"Classic, NexGen or Both",null,null,null,{"$f":"'MPS_CVL NG'!$G$6","v":0}]
[null,null,"User Requires Access to Production, Model or Both",null,null,null,{"$f":"'MPS_CVL NG'!$H$6","v":""}]
{"$rows_left_out":20}
{"sheet":"Coverall 2","index":4,"n_rows":27,"n_cols":9,"rows_kept":27,"cut":false,"hidden":true,"merged":[[26,2,26,4],[26,6,26,8],[22,2,22,8],[23,2,23,4],[23,6,23,8],[24,2,24,4],[24,6,24,8],[25,2,25,4],[25,6,25,8],[20,2,21,8],[14,2,14,4],[14,6,14,8],[15,2,15,4],[15,6,15,8],[16,2,16,4],[16,6,16,8],[17,2,17,4],[17,6,17,8],[18,2,18,4],[18,6,18,8],[19,2,19,4],[11,2,11,4],[11,6,11,8],[12,2,12,4],[12,6,12,8],[13,2,13,4],[13,6,13,8],[10,2,10,8],[2,2,2,8],[3,2,3,4],[3,6,3,8],[4,2,4,4],[4,6,4,8],[5,2,5,4],[5,6,5,8],[6,2,6,4],[6,6,6,8],[7,2,7,4],[7,6,7,8],[8,2,9,8]]}
[]
[]
[null,null,"Lexington MPS/CVL NG User Request Form"]
[null,null,"Request Type",null,null,null,"Add User"]
[null,null,"Request Date",null,null,null,{"$f":"'Systems Request'!$S$12","v":"00:00:00"}]
[null,null,"Request By (Must be user's manager)",null,null,null,{"$f":"'MPS_CVL NG'!$D$7","v":0}]
[null,null,"Classic, NexGen or Both",null,null,null,{"$f":"'MPS_CVL NG'!$G$7","v":""}]
[null,null,"User Requires Access to Production, Model or Both",null,null,null,{"$f":"'MPS_CVL NG'!$H$7","v":""}]
{"$rows_left_out":20}
{"sheet":"Coverall 3","index":5,"n_rows":27,"n_cols":9,"rows_kept":27,"cut":false,"hidden":true,"merged":[[26,2,26,4],[26,6,26,8],[22,2,22,8],[23,2,23,4],[23,6,23,8],[24,2,24,4],[24,6,24,8],[25,2,25,4],[25,6,25,8],[20,2,21,8],[14,2,14,4],[14,6,14,8],[15,2,15,4],[15,6,15,8],[16,2,16,4],[16,6,16,8],[17,2,17,4],[17,6,17,8],[18,2,18,4],[18,6,18,8],[19,2,19,4],[11,2,11,4],[11,6,11,8],[12,2,12,4],[12,6,12,8],[13,2,13,4],[13,6,13,8],[10,2,10,8],[2,2,2,8],[3,2,3,4],[3,6,3,8],[4,2,4,4],[4,6,4,8],[5,2,5,4],[5,6,5,8],[6,2,6,4],[6,6,6,8],[7,2,7,4],[7,6,7,8],[8,2,9,8]]}
[]
[]
[null,null,"Lexington MPS/CVL NG User Request Form"]
[null,null,"Request Type",null,null,null,"Add User"]
[null,null,"Request Date",null,null,null,{"$f":"'Systems Request'!$S$12","v":"00:00:00"}]
[null,null,"Request By (Must be user's manager)",null,null,null,{"$f":"'MPS_CVL NG'!$D$8","v":0}]
[null,null,"Classic, NexGen or Both",null,null,null,{"$f":"'MPS_CVL NG'!$G$8","v":""}]
[null,null,"User Requires Access to Production, Model or Both",null,null,null,{"$f":"'MPS_CVL NG'!$H$8","v":""}]
{"$rows_left_out":20}
{"sheet":"Coverall 4","index":6,"n_rows":27,"n_cols":9,"rows_kept":27,"cut":false,"hidden":true,"merged":[[26,2,26,4],[26,6,26,8],[22,2,22,8],[23,2,23,4],[23,6,23,8],[24,2,24,4],[24,6,24,8],[25,2,25,4],[25,6,25,8],[20,2,21,8],[14,2,14,4],[14,6,14,8],[15,2,15,4],[15,6,15,8],[16,2,16,4],[16,6,16,8],[17,2,17,4],[17,6,17,8],[18,2,18,4],[18,6,18,8],[19,2,19,4],[11,2,11,4],[11,6,11,8],[12,2,12,4],[12,6,12,8],[13,2,13,4],[13,6,13,8],[10,2,10,8],[2,2,2,8],[3,2,3,4],[3,6,3,8],[4,2,4,4],[4,6,4,8],[5,2,5,4],[5,6,5,8],[6,2,6,4],[6,6,6,8],[7,2,7,4],[7,6,7,8],[8,2,9,8]]}
[]
[]
[null,null,"Lexington MPS/CVL NG User Request Form"]
[null,null,"Request Type",null,null,null,"Add User"]
[null,null,"Request Date",null,null,null,{"$f":"'Systems Request'!$S$12","v":"00:00:00"}]
[null,null,"Request By (Must be user's manager)",null,null,null,{"$f":"'MPS_CVL NG'!$D$9","v":0}]
[null,null,"Classic, NexGen or Both",null,null,null,{"$f":"'MPS_CVL NG'!$G$9","v":""}]
[null,null,"User Requires Access to Production, Model or Both",null,null,null,{"$f":"'MPS_CVL NG'!$H$9","v":""}]
{"$rows_left_out":20}
{"sheet":"Coverall 5","index":7,"n_rows":27,"n_cols":9,"rows_kept":27,"cut":false,"hidden":true,"merged":[[26,2,26,4],[26,6,26,8],[22,2,22,8],[23,2,23,4],[23,6,23,8],[24,2,24,4],[24,6,24,8],[25,2,25,4],[25,6,25,8],[20,2,21,8],[14,2,14,4],[14,6,14,8],[15,2,15,4],[15,6,15,8],[16,2,16,4],[16,6,16,8],[17,2,17,4],[17,6,17,8],[18,2,18,4],[18,6,18,8],[19,2,19,4],[11,2,11,4],[11,6,11,8],[12,2,12,4],[12,6,12,8],[13,2,13,4],[13,6,13,8],[10,2,10,8],[2,2,2,8],[3,2,3,4],[3,6,3,8],[4,2,4,4],[4,6,4,8],[5,2,5,4],[5,6,5,8],[6,2,6,4],[6,6,6,8],[7,2,7,4],[7,6,7,8],[8,2,9,8]]}
[]
[]
[null,null,"Lexington MPS/CVL NG User Request Form"]
[null,null,"Request Type",null,null,null,"Add User"]
[null,null,"Request Date",null,null,null,{"$f":"'Systems Request'!$S$12","v":"00:00:00"}]
[null,null,"Request By (Must be user's manager)",null,null,null,{"$f":"'MPS_CVL NG'!$D$10","v":0}]
[null,null,"Classic, NexGen or Both",null,null,null,{"$f":"'MPS_CVL NG'!$G$10","v":""}]
[null,null,"User Requires Access to Production, Model or Both",null,null,null,{"$f":"'MPS_CVL NG'!$H$10","v":""}]
{"$rows_left_out":20}
{"sheet":"Coverall 6","index":8,"n_rows":27,"n_cols":9,"rows_kept":27,"cut":false,"hidden":true,"merged":[[26,2,26,4],[26,6,26,8],[22,2,22,8],[23,2,23,4],[23,6,23,8],[24,2,24,4],[24,6,24,8],[25,2,25,4],[25,6,25,8],[20,2,21,8],[14,2,14,4],[14,6,14,8],[15,2,15,4],[15,6,15,8],[16,2,16,4],[16,6,16,8],[17,2,17,4],[17,6,17,8],[18,2,18,4],[18,6,18,8],[19,2,19,4],[11,2,11,4],[11,6,11,8],[12,2,12,4],[12,6,12,8],[13,2,13,4],[13,6,13,8],[10,2,10,8],[2,2,2,8],[3,2,3,4],[3,6,3,8],[4,2,4,4],[4,6,4,8],[5,2,5,4],[5,6,5,8],[6,2,6,4],[6,6,6,8],[7,2,7,4],[7,6,7,8],[8,2,9,8]]}
[]
[]
[null,null,"Lexington MPS/CVL NG User Request Form"]
[null,null,"Request Type",null,null,null,"Add User"]
[null,null,"Request Date",null,null,null,{"$f":"'Systems Request'!$S$12","v":"00:00:00"}]
[null,null,"Request By (Must be user's manager)",null,null,null,{"$f":"'MPS_CVL NG'!$D$11","v":0}]
[null,null,"Classic, NexGen or Both",null,null,null,{"$f":"'MPS_CVL NG'!$G$11","v":""}]
[null,null,"User Requires Access to Production, Model or Both",null,null,null,{"$f":"'MPS_CVL NG'!$H$11","v":""}]
{"$rows_left_out":20}
{"sheet":"Coverall 7","index":9,"n_rows":27,"n_cols":9,"rows_kept":27,"cut":false,"hidden":true,"merged":[[26,2,26,4],[26,6,26,8],[22,2,22,8],[23,2,23,4],[23,6,23,8],[24,2,24,4],[24,6,24,8],[25,2,25,4],[25,6,25,8],[20,2,21,8],[14,2,14,4],[14,6,14,8],[15,2,15,4],[15,6,15,8],[16,2,16,4],[16,6,16,8],[17,2,17,4],[17,6,17,8],[18,2,18,4],[18,6,18,8],[19,2,19,4],[11,2,11,4],[11,6,11,8],[12,2,12,4],[12,6,12,8],[13,2,13,4],[13,6,13,8],[10,2,10,8],[2,2,2,8],[3,2,3,4],[3,6,3,8],[4,2,4,4],[4,6,4,8],[5,2,5,4],[5,6,5,8],[6,2,6,4],[6,6,6,8],[7,2,7,4],[7,6,7,8],[8,2,9,8]]}
[]
[]
[null,null,"Lexington MPS/CVL NG User Request Form"]
[null,null,"Request Type",null,null,null,"Add User"]
[null,null,"Request Date",null,null,null,{"$f":"'Systems Request'!$S$12","v":"00:00:00"}]
[null,null,"Request By (Must be user's manager)",null,null,null,{"$f":"'MPS_CVL NG'!$D$12","v":0}]
[null,null,"Classic, NexGen or Both",null,null,null,{"$f":"'MPS_CVL NG'!$G$12","v":""}]
[null,null,"User Requires Access to Production, Model or Both",null,null,null,{"$f":"'MPS_CVL NG'!$H$12","v":""}]
{"$rows_left_out":20}
{"sheet":"Coverall 8","index":10,"n_rows":27,"n_cols":9,"rows_kept":27,"cut":false,"hidden":true,"merged":[[26,2,26,4],[26,6,26,8],[22,2,22,8],[23,2,23,4],[23,6,23,8],[24,2,24,4],[24,6,24,8],[25,2,25,4],[25,6,25,8],[20,2,21,8],[14,2,14,4],[14,6,14,8],[15,2,15,4],[15,6,15,8],[16,2,16,4],[16,6,16,8],[17,2,17,4],[17,6,17,8],[18,2,18,4],[18,6,18,8],[19,2,19,4],[11,2,11,4],[11,6,11,8],[12,2,12,4],[12,6,12,8],[13,2,13,4],[13,6,13,8],[10,2,10,8],[2,2,2,8],[3,2,3,4],[3,6,3,8],[4,2,4,4],[4,6,4,8],[5,2,5,4],[5,6,5,8],[6,2,6,4],[6,6,6,8],[7,2,7,4],[7,6,7,8],[8,2,9,8]]}
[]
[]
[null,null,"Lexington MPS/CVL NG User Request Form"]
[null,null,"Request Type",null,null,null,"Add User"]
[null,null,"Request Date",null,null,null,{"$f":"'Systems Request'!$S$12","v":"00:00:00"}]
[null,null,"Request By (Must be user's manager)",null,null,null,{"$f":"'MPS_CVL NG'!$D$13","v":0}]
[null,null,"Classic, NexGen or Both",null,null,null,{"$f":"'MPS_CVL NG'!$G$13","v":""}]
[null,null,"User Requires Access to Production, Model or Both",null,null,null,{"$f":"'MPS_CVL NG'!$H$13","v":""}]
{"$rows_left_out":20}
{"sheet":"Coverall 9","index":11,"n_rows":27,"n_cols":9,"rows_kept":27,"cut":false,"hidden":true,"merged":[[26,2,26,4],[26,6,26,8],[22,2,22,8],[23,2,23,4],[23,6,23,8],[24,2,24,4],[24,6,24,8],[25,2,25,4],[25,6,25,8],[20,2,21,8],[14,2,14,4],[14,6,14,8],[15,2,15,4],[15,6,15,8],[16,2,16,4],[16,6,16,8],[17,2,17,4],[17,6,17,8],[18,2,18,4],[18,6,18,8],[19,2,19,4],[11,2,11,4],[11,6,11,8],[12,2,12,4],[12,6,12,8],[13,2,13,4],[13,6,13,8],[10,2,10,8],[2,2,2,8],[3,2,3,4],[3,6,3,8],[4,2,4,4],[4,6,4,8],[5,2,5,4],[5,6,5,8],[6,2,6,4],[6,6,6,8],[7,2,7,4],[7,6,7,8],[8,2,9,8]]}
[]
[]
[null,null,"Lexington MPS/CVL NG User Request Form"]
[null,null,"Request Type",null,null,null,"Add User"]
[null,null,"Request Date",null,null,null,{"$f":"'Systems Request'!$S$12","v":"00:00:00"}]
[null,null,"Request By (Must be user's manager)",null,null,null,{"$f":"'MPS_CVL NG'!$D$14","v":0}]
[null,null,"Classic, NexGen or Both",null,null,null,{"$f":"'MPS_CVL NG'!$G$14","v":""}]
[null,null,"User Requires Access to Production, Model or Both",null,null,null,{"$f":"'MPS_CVL NG'!$H$14","v":""}]
{"$rows_left_out":20}
{"sheet":"Coverall 10","index":12,"n_rows":27,"n_cols":9,"rows_kept":27,"cut":false,"hidden":true,"merged":[[26,2,26,4],[26,6,26,8],[22,2,22,8],[23,2,23,4],[23,6,23,8],[24,2,24,4],[24,6,24,8],[25,2,25,4],[25,6,25,8],[20,2,21,8],[14,2,14,4],[14,6,14,8],[15,2,15,4],[15,6,15,8],[16,2,16,4],[16,6,16,8],[17,2,17,4],[17,6,17,8],[18,2,18,4],[18,6,18,8],[19,2,19,4],[11,2,11,4],[11,6,11,8],[12,2,12,4],[12,6,12,8],[13,2,13,4],[13,6,13,8],[10,2,10,8],[2,2,2,8],[3,2,3,4],[3,6,3,8],[4,2,4,4],[4,6,4,8],[5,2,5,4],[5,6,5,8],[6,2,6,4],[6,6,6,8],[7,2,7,4],[7,6,7,8],[8,2,9,8]]}
[]
[]
[null,null,"Lexington MPS/CVL NG User Request Form"]
[null,null,"Request Type",null,null,null,"Add User"]
[null,null,"Request Date",null,null,null,{"$f":"'Systems Request'!$S$12","v":"00:00:00"}]
[null,null,"Request By (Must be user's manager)",null,null,null,{"$f":"'MPS_CVL NG'!$D$15","v":0}]
[null,null,"Classic, NexGen or Both",null,null,null,{"$f":"'MPS_CVL NG'!$G$15","v":""}]
[null,null,"User Requires Access to Production, Model or Both",null,null,null,{"$f":"'MPS_CVL NG'!$H$15","v":""}]
{"$rows_left_out":20}
{"sheet":"Dropdowns","index":13,"n_rows":12,"n_cols":9,"rows_kept":12,"cut":false,"hidden":true,"merged":[]}
["Select Job Function",null,"MPS/CVL Role",null,"View Source",null,"MPS/CVL Version",null,"Access to Production, Model or Both"]
["Agency Executive (President/CEO)",null,"Select Role",null,"AIG Claims",null,"Select MPS/CVL Version",null,"Select Access"]
["Operations Manager",null,"View Only",null,"GB Claims",null,"NexGen",null,"Production"]
["IT Manager",null,"Underwriter Assistant",null,"York Claims",null,null,null,"Model"]
["Underwriting Manager",null,"Underwriter PA",null,"Premium Audit",null,null,null,"Both"]
["Underwriter",null,"PA Manager",null,"Lex Accounting"]
["Underwriting Assistant",null,"UW Codes",null,"Other"]
[null,null,null,null,"NA"]
{"$rows_left_out":4}