{"text_format":"1","workbook":"xlsx","n_sheets":14,"sheets":["Systems Request","MPS_CVL NG","Internal Systems Request","Coverall 1","Coverall 2","Coverall 3","Coverall 4","Coverall 5","Coverall 6","Coverall 7","Coverall 8","Coverall 9","Coverall 10","Dropdowns"],"not_rendered":{"charts":0,"images":3,"macros":1,"external_links":0,"defined_names":1,"comments":0,"pivot_tables":0},"unopened":[],"bounds":{"document_bytes":16777216,"sheet_cells":100000,"rows_first":2000,"rows_last":500,"rows_between":2000,"halvings":0,"cell_chars":16384,"cell_head_chars":4096},"cells_cut":0,"cells_raw":0,"read":"whole","date_system":"1900"}

{"sheet":"Systems Request","index":0,"n_rows":38,"n_cols":23,"rows_kept":38,"cut":false,"hidden":false,"merged":[[1,15,3,19],[12,2,12,6],[13,2,13,6],[9,16,9,17],[10,16,10,17],[8,7,8,14],[9,7,9,14],[10,7,10,14],[11,7,11,14],[12,7,12,14],[13,7,13,14],[8,2,8,6],[9,2,9,6],[10,2,10,6],[12,16,12,17],[6,0,6,21],[37,2,37,20],[20,17,23,17],[11,2,11,6],[16,2,16,21],[8,19,8,20],[36,2,36,20],[21,12,23,12],[21,7,23,7],[21,8,23,8],[21,9,23,9],[21,2,23,2],[21,3,23,3],[21,4,23,4],[21,15,23,15],[7,2,7,14],[7,16,7,18],[5,0,5,21],[35,2,35,20],[16,0,16,1],[21,5,23,5],[21,6,23,6],[20,16,23,16],[4,20,4,21],[21,10,23,10],[21,11,23,11],[21,14,23,14],[21,13,23,13],[8,16,8,17],[11,16,11,17],[20,18,23,18],[20,19,23,19],[20,20,23,20],[20,21,23,21],[19,16,19,21],[20,2,20,15]]}
[]
[null,null,null,null,null,null,null,null,null,null,null,null,null,null,null,"Systems Request"]
[]
[]
[null,null,null,null,null,null,null,null,null,null,null,null,null,null,null,null,null,null,null,null,"Please fill out all necessary fields, save a copy for your records, and send the original to AIG Broker Services at  ToServe@AIG.com\n\nIf you are requesting MPS/CoverAll, the subject line should have \"MPS / CoverAll\" noted"]
[]
[]
[null,null,"MUST BE COMPLETED",null,null,null,null,null,null,null,null,null,null,null,null,null,"MUST BE COMPLETED"]
[null,null,"Brokerage",null,null,null,null,null,null,null,null,null,null,null,null,null,"National Producer Number",null,null,"Make sure to enable content"]
[null,null,"Address",null,null,null,null,null,null,null,null,null,null,null,null,null,"Producer Number"]
[null,null,"Address",null,null,null,null,null,null,null,null,null,null,null,null,null,"States Licensed"]
[null,null,"City",null,null,null,null,null,null,null,null,null,null,null,null,null,"Request Date"]
[null,null,"State",null,null,null,null,null,null,null,null,null,null,null,null,null,"Confirm Multi Factor Authentication System"]
[null,null,"Zip Code"]
[]
[]
[null,null,"For additional information on how to access State Rate information see the attached 'SOP_State_Rate_Website_Info.doc'\nNOTE:  Access to these sites, if necessary, is the responsibility of the Program Administrator & NOT AIG."]
[]
[]
[null,null,null,null,null,null,null,null,null,null,null,null,null,null,null,null,"REQUIRED FIELDS"]
[null,null,"Place an \"X\" to indicate the system to be requested for each person listed",null,null,null,null,null,null,null,null,null,null,null,null,null,"First Name","Last Name","Middle Initial","Select Job Function","Phone #","Email Address"]
[null,null,"ALIR_DMV","E_Start","ODEN PT","** MVR\n(Lexis Nexis)","MPS / CVL_NG","ISO ProMetrix","CoreLogic\n-Marshall & Swift","Risk Meter","Tyler Ins Filings\n(formerly NOR)\n (Online Registries & Motor Carrier)","** FMCSA \n- Federal Motor \nCarrier Safety Admin","Intellirisk \nAutomatic Access","E-Delivery\nAutomatic Access","* Mainframe","* www.MyAIG.com"]
[]
[]
[null,null,null,null,null,null,null,null,null,null,null,null,null,null,null,null,null,null,null,"Select Job Function",null,null,{"$f":"IF(G25=\"x\",\"Please fill out MPS_CVL NG Tab for this User\",\"\")","v":""}]
[null,null,null,null,null,null,null,null,null,null,null,null,null,null,null,null,null,null,null,"Select Job Function",null,null,""]
[null,null,null,null,null,null,null,null,null,null,null,null,null,null,null,null,null,null,null,"Select Job Function",null,null,""]
[null,null,null,null,null,null,null,null,null,null,null,null,null,null,null,null,null,null,null,"Select Job Function",null,null,""]
[null,null,null,null,null,null,null,null,null,null,null,null,null,null,null,null,null,null,null,"Select Job Function",null,null,""]
[null,null,null,null,null,null,null,null,null,null,null,null,null,null,null,null,null,null,null,"Select Job Function",null,null,""]
[null,null,null,null,null,null,null,null,null,null,null,null,null,null,null,null,null,null,null,"Select Job Function",null,null,""]
[null,null,null,null,null,null,null,null,null,null,null,null,null,null,null,null,null,null,null,"Select Job Function",null,null,""]
[null,null,null,null,null,null,null,null,null,null,null,null,null,null,null,null,null,null,null,"Select Job Function",null,null,""]
[null,null,null,null,null,null,null,null,null,null,null,null,null,null,null,null,null,null,null,"Select Job Function",null,null,""]
[]
[null,null,"* Required Systems, Always enter an X here."]
[null,null,"** MVR (Lexis Nexis) and FMCSA are used to set up the PA at Onboarding only.  \nOnce the initial PA access has been granted, the PA then contacts MVR Lexis Nexis directly to obtain additional access for new users as they come onboard.  There is no additional set up necessary for FMCSA\nContact Information: \nemail epic360@lexisnexisrisk.com \nphone 1-866-208-1420 for assistance."]
[null,null,"NOTE: E-Delivery is automatically provided to any user of www.MyAIG.com"]

{"sheet":"MPS_CVL NG","index":1,"n_rows":47,"n_cols":11,"rows_kept":47,"cut":false,"hidden":false,"merged":[]}
[]
[]
[]
[]
["Name","Select MPS Role-See below for Role Descriptions","Optional Underwriter ID?","User's Manager or Program Manager","For \"View Only\" Role","If Source is \"other\" Identify Source","SELECT \nMPS / CVL NG","User Requires Access to Production, Model or Both","Business Justification for Access Granted","Grant Access to Producer Number","Enter Additional Producer Numbers if Needed"]
[{"$f":"IF('Systems Request'!G25=\"X\",'Systems Request'!Q25&\" \" & 'Systems Request'!S25&\" \" &'Systems Request'!R25,\"\")","v":""},{"$f":"IF(A6<>\"\",\"Select Role\",\"\")","v":""},{"$f":"IF(B6=\"Underwriter Assistant\",\"Select Yes or No\",\"\")","v":""},null,{"$f":"IF(A6<>\"\",\"Select Source\",\"\")","v":""},{"$f":"IF(E6=\"Other\",\"Enter Source\",\"NA\")","v":"NA"},null,{"$f":"IF(A6<>\"\",\"Select Access\",\"\")","v":""},null,{"$f":"IF('Systems Request'!G25=\"X\",'Systems Request'!S10,\"\")","v":""}]
[{"$f":"IF('Systems Request'!G26=\"X\",'Systems Request'!Q26&\" \" & 'Systems Request'!S26&\" \" &'Systems Request'!R26,\"\")","v":""},{"$f":"IF(A7<>\"\",\"Select Role\",\"\")","v":""},{"$f":"IF(B7=\"Underwriter Assistant\",\"Select Yes or No\",\"\")","v":""},null,{"$f":"IF(A7<>\"\",\"Select Source\",\"\")","v":""},{"$f":"IF(E7=\"Other\",\"Enter Source\",\"NA\")","v":"NA"},{"$f":"IF(A7<>\"\",\"Select MPS/CVL NG Version\",\"\")","v":""},"",null,{"$f":"IF('Systems Request'!G26=\"X\",'Systems Request'!S10,\"\")","v":""}]
[{"$f":"IF('Systems Request'!G27=\"X\",'Systems Request'!Q27&\" \" & 'Systems Request'!S27&\" \" &'Systems Request'!R27,\"\")","v":""},{"$f":"IF(A8<>\"\",\"Select Role\",\"\")","v":""},"",null,"","NA","","",{"$f":"IF(A8<>\"\",\"Enter Business Justification\",\"\")","v":""},{"$f":"IF('Systems Request'!G27=\"X\",'Systems Request'!S10,\"\")","v":""}]
[{"$f":"IF('Systems Request'!G28=\"X\",'Systems Request'!Q28&\" \" & 'Systems Request'!S28&\" \" &'Systems Request'!R28,\"\")","v":""},"","",null,"","NA","","","",{"$f":"IF('Systems Request'!G28=\"X\",'Systems Request'!S10,\"\")","v":""}]
[{"$f":"IF('Systems Request'!G29=\"X\",'Systems Request'!Q29&\" \" & 'Systems Request'!S29&\" \" &'Systems Request'!R29,\"\")","v":""},"","",null,"","NA","","","",{"$f":"IF('Systems Request'!G29=\"X\",'Systems Request'!S10,\"\")","v":""}]
[{"$f":"IF('Systems Request'!G30=\"X\",'Systems Request'!Q30&\" \" & 'Systems Request'!S30&\" \" &'Systems Request'!R30,\"\")","v":""},"","",null,"","NA","","","",{"$f":"IF('Systems Request'!G30=\"X\",'Systems Request'!S10,\"\")","v":""}]
[{"$f":"IF('Systems Request'!G31=\"X\",'Systems Request'!Q31&\" \" & 'Systems Request'!S31&\" \" &'Systems Request'!R31,\"\")","v":""},"","",null,"","NA","","","",{"$f":"IF('Systems Request'!G31=\"X\",'Systems Request'!S10,\"\")","v":""}]
[{"$f":"IF('Systems Request'!G32=\"X\",'Systems Request'!Q32&\" \" & 'Systems Request'!S32&\" \" &'Systems Request'!R32,\"\")","v":""},"","",null,"","NA","","","",{"$f":"IF('Systems Request'!G32=\"X\",'Systems Request'!S10,\"\")","v":""}]
[{"$f":"IF('Systems Request'!G33=\"X\",'Systems Request'!Q33&\" \" & 'Systems Request'!S33&\" \" &'Systems Request'!R33,\"\")","v":""},"","",null,"","NA","","","",{"$f":"IF('Systems Request'!G33=\"X\",'Systems Request'!S10,\"\")","v":""}]
[{"$f":"IF('Systems Request'!G34=\"X\",'Systems Request'!Q34&\" \" & 'Systems Request'!S34&\" \" &'Systems Request'!R34,\"\")","v":""},"","",null,"","NA","","","",{"$f":"IF('Systems Request'!G34=\"X\",'Systems Request'!S10,\"\")","v":""}]
[]
["View Only"]
[null,"•     Policy view and print capability only"]
[null,"•     Able to utilize the search function in portal"]
[null,"•     Cannot perform operations functions such as quote, endorse or issue"]
[]
["Underwriter Assistant"]
[null,"• Can process all transactions in both Portal and R&I with the exception of: convert quote, create "]
[null,"policy, renew policy book policy and final audit"]
[null,"•     User can quote but not book a policy"]
[null,"• Has Portal access to underwriter views (underwriter desktop and underwriter analysis)"]
[null,"•     May have their own underwriter code if requested"]
[]
["Underwriter PA (Requires Underwriter ID)"]
[null,"•     Has access to all functions in both Portal and R&I"]
[null,"•     Can quote, convert, book and audit policies"]
[null,"•     Has an underwriter code for policy assignment"]
[null,"•    Can review portal reports on lines of business assigned to themselves"]
[]
["PA Manager (Requires Underwriter ID)"]
[null,"•     Role designed for agency manager"]
[null,"• All functions assigned to the underwriter role as well as PA Analysis and PA Performance. These "]
[null,"reports provide data for an entire producer code"]
[]
[null,"Underwriter Codes are a policy assignment tool. Users with an underwriter code can have work "]
[null,"assigned to them. Performance reporting in portal can be segmented by underwriter code."]
[]
[null,"Rating can be processed by one user (ex. underwriter assistant) under an underwriter code for "]
[null,"another individual (ex. account underwriter). This will enable reporting on the underwriter’s book "]
[null,"of business. However, where the operator is not the underwriter, portal reporting will not segment "]
[null,"out the performance of the"]
[null,"ter."]

{"sheet":"Internal Systems Request","index":2,"n_rows":30,"n_cols":29,"rows_kept":30,"cut":false,"hidden":true,"merged":[[1,3,3,3],[1,0,3,0],[1,1,3,1],[0,17,3,17],[0,18,3,18],[1,4,3,4],[1,5,3,5],[0,13,3,13],[0,14,3,14],[1,12,3,12],[1,10,3,10],[0,0,0,12],[0,16,3,16],[1,2,3,2],[0,28,3,28],[0,19,3,19],[0,20,3,20],[1,6,3,6],[0,22,3,22],[1,8,3,8],[0,24,3,24],[1,7,3,7],[0,21,3,21],[1,9,3,9],[0,23,3,23],[0,15,3,15],[1,11,3,11],[0,26,3,26],[0,27,3,27],[0,25,3,25]]}
["Systems Requested",null,null,null,null,null,null,null,null,null,null,null,null,"Last Name","First Name","Middle Initial","Job Function","National Producer Number","States Licensed","Brokerage","Address1","Address2","City","State","Postal Code","Phone #","Internet Address","Producer \nCode","Mainframe ID"]
["ALIR - DMV","E-Start","ODEN PT","MVR","MPS/CVL NG","Intellirisk","ISO SPI Plus","Mainframe","Marshall & Swift","Risk Meter","NOR (Online\nRegistries &\nMotor Carrier)","E-Delivery","PA Portal"]
[]
[]
[{"$f":"IF('Systems Request'!C25<>\"\",'Systems Request'!C25,\"\")","v":""},{"$f":"IF('Systems Request'!D25<>\"\",'Systems Request'!D25,\"\")","v":""},{"$f":"IF('Systems Request'!E25<>\"\",'Systems Request'!E25,\"\")","v":""},{"$f":"IF('Systems Request'!F25<>\"\",'Systems Request'!F25,\"\")","v":""},{"$f":"IF('Systems Request'!G25<>\"\",'Systems Request'!G25,\"\")","v":""},{"$f":"IF('Systems Request'!M25<>\"\",'Systems Request'!M25,\"\")","v":""},{"$f":"IF('Systems Request'!H25<>\"\",'Systems Request'!H25,\"\")","v":""},{"$f":"IF('Systems Request'!I25<>\"\",'Systems Request'!I25,\"\")","v":""},{"$f":"IF('Systems Request'!J25<>\"\",'Systems Request'!J25,\"\")","v":""},{"$f":"IF('Systems Request'!K25<>\"\",'Systems Request'!K25,\"\")","v":""},{"$f":"IF('Systems Request'!L25<>\"\",'Systems Request'!L25,\"\")","v":""},{"$f":"IF('Systems Request'!O25<>\"\",'Systems Request'!O25,\"\")","v":""},{"$f":"IF('Systems Request'!N25<>\"\",'Systems Request'!N25,\"\")","v":""},{"$f":"IF('Systems Request'!R25<>\"\",'Systems Request'!R25,\"\")","v":""},{"$f":"IF('Systems Request'!Q25<>\"\",'Systems Request'!Q25,\"\")","v":""},{"$f":"IF('Systems Request'!S25<>\"\",'Systems Request'!S25,\"\")","v":""},{"$f":"IF('Systems Request'!T25<>\"\",'Systems Request'!T25,\"\")","v":"Select Job Function"},{"$f":"IF('Systems Request'!Q25<>\"\",'Systems Request'!S$9,\"\")","v":""},{"$f":"IF('Systems Request'!Q25<>\"\",'Systems Request'!$S$11,\"\")","v":""},{"$f":"IF('Systems Request'!Q25<>\"\",'Systems Request'!$H$9,\"\")","v":""},{"$f":"IF('Systems Request'!Q25<>\"\",'Systems Request'!$H$10,\"\")","v":""},{"$f":"IF('Systems Request'!Q25<>\"\",'Systems Request'!$H$11,\"\")","v":""},{"$f":"IF('Systems Request'!Q25<>\"\",'Systems Request'!$H$12,\"\")","v":""},{"$f":"IF('Systems Request'!Q25<>\"\",'Systems Request'!$H$13,\"\")","v":""},{"$f":"IF('Systems Request'!Q25<>\"\",'Systems Request'!$H$14,\"\")","v":""},{"$f":"IF('Systems Request'!Q25<>\"\",'Systems Request'!$U$25,\"\")","v":""},{"$f":"IF('Systems Request'!Q25<>\"\",'Systems Request'!$V$25,\"\")","v":""},{"$f":"IF('Systems Request'!Q25<>\"\",'Systems Request'!$R$10,\"\")","v":""},{"$f":"IF('Systems Request'!Q25<>\"\",\"Assign Mainframe ID\",\"\")","v":""}]
[{"$f":"IF('Systems Request'!C26<>\"\",'Systems Request'!C26,\"\")","v":""},{"$f":"IF('Systems Request'!D26<>\"\",'Systems Request'!D26,\"\")","v":""},{"$f":"IF('Systems Request'!E26<>\"\",'Systems Request'!E26,\"\")","v":""},{"$f":"IF('Systems Request'!F26<>\"\",'Systems Request'!F26,\"\")","v":""},{"$f":"IF('Systems Request'!G26<>\"\",'Systems Request'!G26,\"\")","v":""},{"$f":"IF('Systems Request'!M26<>\"\",'Systems Request'!M26,\"\")","v":""},{"$f":"IF('Systems Request'!H26<>\"\",'Systems Request'!H26,\"\")","v":""},{"$f":"IF('Systems Request'!I26<>\"\",'Systems Request'!I26,\"\")","v":""},{"$f":"IF('Systems Request'!J26<>\"\",'Systems Request'!J26,\"\")","v":""},{"$f":"IF('Systems Request'!K26<>\"\",'Systems Request'!K26,\"\")","v":""},{"$f":"IF('Systems Request'!L26<>\"\",'Systems Request'!L26,\"\")","v":""},{"$f":"IF('Systems Request'!O26<>\"\",'Systems Request'!O26,\"\")","v":""},{"$f":"IF('Systems Request'!N26<>\"\",'Systems Request'!N26,\"\")","v":""},{"$f":"IF('Systems Request'!R26<>\"\",'Systems Request'!R26,\"\")","v":""},{"$f":"IF('Systems Request'!Q26<>\"\",'Systems Request'!Q26,\"\")","v":""},{"$f":"IF('Systems Request'!S26<>\"\",'Systems Request'!S26,\"\")","v":""},{"$f":"IF('Systems Request'!T26<>\"\",'Systems Request'!T26,\"\")","v":"Select Job Function"},{"$f":"IF('Systems Request'!Q26<>\"\",'Systems Request'!S$9,\"\")","v":""},{"$f":"IF('Systems Request'!Q26<>\"\",'Systems Request'!$S$11,\"\")","v":""},{"$f":"IF('Systems Request'!Q26<>\"\",'Systems Request'!$H$9,\"\")","v":""},{"$f":"IF('Systems Request'!Q26<>\"\",'Systems Request'!$H$10,\"\")","v":""},{"$f":"IF('Systems Request'!Q26<>\"\",'Systems Request'!$H$11,\"\")","v":""},{"$f":"IF('Systems Request'!Q26<>\"\",'Systems Request'!$H$12,\"\")","v":""},{"$f":"IF('Systems Request'!Q26<>\"\",'Systems Request'!$H$13,\"\")","v":""},{"$f":"IF('Systems Request'!Q26<>\"\",'Systems Request'!$H$14,\"\")","v":""},{"$f":"IF('Systems Request'!Q26<>\"\",'Systems Request'!$U$26,\"\")","v":""},{"$f":"IF('Systems Request'!Q26<>\"\",'Systems Request'!$V$26,\"\")","v":""},{"$f":"IF('Systems Request'!Q26<>\"\",'Systems Request'!$R$10,\"\")","v":""},{"$f":"IF('Systems Request'!Q26<>\"\",\"Assign Mainframe ID\",\"\")","v":""}]
[{"$f":"IF('Systems Request'!C27<>\"\",'Systems Request'!C27,\"\")","v":""},{"$f":"IF('Systems Request'!D27<>\"\",'Systems Request'!D27,\"\")","v":""},{"$f":"IF('Systems Request'!E27<>\"\",'Systems Request'!E27,\"\")","v":""},{"$f":"IF('Systems Request'!F27<>\"\",'Systems Request'!F27,\"\")","v":""},{"$f":"IF('Systems Request'!G27<>\"\",'Systems Request'!G27,\"\")","v":""},{"$f":"IF('Systems Request'!M27<>\"\",'Systems Request'!M27,\"\")","v":""},{"$f":"IF('Systems Request'!H27<>\"\",'Systems Request'!H27,\"\")","v":""},{"$f":"IF('Systems Request'!I27<>\"\",'Systems Request'!I27,\"\")","v":""},{"$f":"IF('Systems Request'!J27<>\"\",'Systems Request'!J27,\"\")","v":""},{"$f":"IF('Systems Request'!K27<>\"\",'Systems Request'!K27,\"\")","v":""},{"$f":"IF('Systems Request'!L27<>\"\",'Systems Request'!L27,\"\")","v":""},{"$f":"IF('Systems Request'!O27<>\"\",'Systems Request'!O27,\"\")","v":""},{"$f":"IF('Systems Request'!N27<>\"\",'Systems Request'!N27,\"\")","v":""},{"$f":"IF('Systems Request'!R27<>\"\",'Systems Request'!R27,\"\")","v":""},{"$f":"IF('Systems Request'!Q27<>\"\",'Systems Request'!Q27,\"\")","v":""},{"$f":"IF('Systems Request'!S27<>\"\",'Systems Request'!S27,\"\")","v":""},{"$f":"IF('Systems Request'!T27<>\"\",'Systems Request'!T27,\"\")","v":"Select Job Function"},{"$f":"IF('Systems Request'!Q27<>\"\",'Systems Request'!S$9,\"\")","v":""},{"$f":"IF('Systems Request'!Q27<>\"\",'Systems Request'!$S$11,\"\")","v":""},{"$f":"IF('Systems Request'!Q27<>\"\",'Systems Request'!$H$9,\"\")","v":""},{"$f":"IF('Systems Request'!Q27<>\"\",'Systems Request'!$H$10,\"\")","v":""},{"$f":"IF('Systems Request'!Q27<>\"\",'Systems Request'!$H$11,\"\")","v":""},{"$f":"IF('Systems Request'!Q27<>\"\",'Systems Request'!$H$12,\"\")","v":""},{"$f":"IF('Systems Request'!Q27<>\"\",'Systems Request'!$H$13,\"\")","v":""},{"$f":"IF('Systems Request'!Q27<>\"\",'Systems Request'!$H$14,\"\")","v":""},{"$f":"IF('Systems Request'!Q27<>\"\",'Systems Request'!$U$27,\"\")","v":""},{"$f":"IF('Systems Request'!Q27<>\"\",'Systems Request'!$V$27,\"\")","v":""},{"$f":"IF('Systems Request'!Q27<>\"\",'Systems Request'!$R$10,\"\")","v":""},{"$f":"IF('Systems Request'!Q27<>\"\",\"Assign Mainframe ID\",\"\")","v":""}]
[{"$f":"IF('Systems Request'!C28<>\"\",'Systems Request'!C28,\"\")","v":""},{"$f":"IF('Systems Request'!D28<>\"\",'Systems Request'!D28,\"\")","v":""},{"$f":"IF('Systems Request'!E28<>\"\",'Systems Request'!E28,\"\")","v":""},{"$f":"IF('Systems Request'!F28<>\"\",'Systems Request'!F28,\"\")","v":""},{"$f":"IF('Systems Request'!G28<>\"\",'Systems Request'!G28,\"\")","v":""},{"$f":"IF('Systems Request'!M28<>\"\",'Systems Request'!M28,\"\")","v":""},{"$f":"IF('Systems Request'!H28<>\"\",'Systems Request'!H28,\"\")","v":""},{"$f":"IF('Systems Request'!I28<>\"\",'Systems Request'!I28,\"\")","v":""},{"$f":"IF('Systems Request'!J28<>\"\",'Systems Request'!J28,\"\")","v":""},{"$f":"IF('Systems Request'!K28<>\"\",'Systems Request'!K28,\"\")","v":""},{"$f":"IF('Systems Request'!L28<>\"\",'Systems Request'!L28,\"\")","v":""},{"$f":"IF('Systems Request'!O28<>\"\",'Systems Request'!O28,\"\")","v":""},{"$f":"IF('Systems Request'!N28<>\"\",'Systems Request'!N28,\"\")","v":""},{"$f":"IF('Systems Request'!R28<>\"\",'Systems Request'!R28,\"\")","v":""},{"$f":"IF('Systems Request'!Q28<>\"\",'Systems Request'!Q28,\"\")","v":""},{"$f":"IF('Systems Request'!S28<>\"\",'Systems Request'!S28,\"\")","v":""},{"$f":"IF('Systems Request'!T28<>\"\",'Systems Request'!T28,\"\")","v":"Select Job Function"},{"$f":"IF('Systems Request'!Q28<>\"\",'Systems Request'!S$9,\"\")","v":""},{"$f":"IF('Systems Request'!Q28<>\"\",'Systems Request'!$S$11,\"\")","v":""},{"$f":"IF('Systems Request'!Q28<>\"\",'Systems Request'!$H$9,\"\")","v":""},{"$f":"IF('Systems Request'!Q28<>\"\",'Systems Request'!$H$10,\"\")","v":""},{"$f":"IF('Systems Request'!Q28<>\"\",'Systems Request'!$H$11,\"\")","v":""},{"$f":"IF('Systems Request'!Q28<>\"\",'Systems Request'!$H$12,\"\")","v":""},{"$f":"IF('Systems Request'!Q28<>\"\",'Systems Request'!$H$13,\"\")","v":""},{"$f":"IF('Systems Request'!Q28<>\"\",'Systems Request'!$H$14,\"\")","v":""},{"$f":"IF('Systems Request'!Q28<>\"\",'Systems Request'!$U$28,\"\")","v":""},{"$f":"IF('Systems Request'!Q28<>\"\",'Systems Request'!$V$28,\"\")","v":""},{"$f":"IF('Systems Request'!Q28<>\"\",'Systems Request'!$R$10,\"\")","v":""},{"$f":"IF('Systems Request'!Q28<>\"\",\"Assign Mainframe ID\",\"\")","v":""}]
[{"$f":"IF('Systems Request'!C29<>\"\",'Systems Request'!C29,\"\")","v":""},{"$f":"IF('Systems Request'!D29<>\"\",'Systems Request'!D29,\"\")","v":""},{"$f":"IF('Systems Request'!E29<>\"\",'Systems Request'!E29,\"\")","v":""},{"$f":"IF('Systems Request'!F29<>\"\",'Systems Request'!F29,\"\")","v":""},{"$f":"IF('Systems Request'!G29<>\"\",'Systems Request'!G29,\"\")","v":""},{"$f":"IF('Systems Request'!M29<>\"\",'Systems Request'!M29,\"\")","v":""},{"$f":"IF('Systems Request'!H29<>\"\",'Systems Request'!H29,\"\")","v":""},{"$f":"IF('Systems Request'!I29<>\"\",'Systems Request'!I29,\"\")","v":""},{"$f":"IF('Systems Request'!J29<>\"\",'Systems Request'!J29,\"\")","v":""},{"$f":"IF('Systems Request'!K29<>\"\",'Systems Request'!K29,\"\")","v":""},{"$f":"IF('Systems Request'!L29<>\"\",'Systems Request'!L29,\"\")","v":""},{"$f":"IF('Systems Request'!O29<>\"\",'Systems Request'!O29,\"\")","v":""},{"$f":"IF('Systems Request'!N29<>\"\",'Systems Request'!N29,\"\")","v":""},{"$f":"IF('Systems Request'!R29<>\"\",'Systems Request'!R29,\"\")","v":""},{"$f":"IF('Systems Request'!Q29<>\"\",'Systems Request'!Q29,\"\")","v":""},{"$f":"IF('Systems Request'!S29<>\"\",'Systems Request'!S29,\"\")","v":""},{"$f":"IF('Systems Request'!T29<>\"\",'Systems Request'!T29,\"\")","v":"Select Job Function"},{"$f":"IF('Systems Request'!Q29<>\"\",'Systems Request'!S$9,\"\")","v":""},{"$f":"IF('Systems Request'!Q29<>\"\",'Systems Request'!$S$11,\"\")","v":""},{"$f":"IF('Systems Request'!Q29<>\"\",'Systems Request'!$H$9,\"\")","v":""},{"$f":"IF('Systems Request'!Q29<>\"\",'Systems Request'!$H$10,\"\")","v":""},{"$f":"IF('Systems Request'!Q29<>\"\",'Systems Request'!$H$11,\"\")","v":""},{"$f":"IF('Systems Request'!Q29<>\"\",'Systems Request'!$H$12,\"\")","v":""},{"$f":"IF('Systems Request'!Q29<>\"\",'Systems Request'!$H$13,\"\")","v":""},{"$f":"IF('Systems Request'!Q29<>\"\",'Systems Request'!$H$14,\"\")","v":""},{"$f":"IF('Systems Request'!Q29<>\"\",'Systems Request'!$U$29,\"\")","v":""},{"$f":"IF('Systems Request'!Q29<>\"\",'Systems Request'!$V$29,\"\")","v":""},{"$f":"IF('Systems Request'!Q29<>\"\",'Systems Request'!$R$10,\"\")","v":""},{"$f":"IF('Systems Request'!Q29<>\"\",\"Assign Mainframe ID\",\"\")","v":""}]
[{"$f":"IF('Systems Request'!C30<>\"\",'Systems Request'!C30,\"\")","v":""},{"$f":"IF('Systems Request'!D30<>\"\",'Systems Request'!D30,\"\")","v":""},{"$f":"IF('Systems Request'!E30<>\"\",'Systems Request'!E30,\"\")","v":""},{"$f":"IF('Systems Request'!F30<>\"\",'Systems Request'!F30,\"\")","v":""},{"$f":"IF('Systems Request'!G30<>\"\",'Systems Request'!G30,\"\")","v":""},{"$f":"IF('Systems Request'!M30<>\"\",'Systems Request'!M30,\"\")","v":""},{"$f":"IF('Systems Request'!H30<>\"\",'Systems Request'!H30,\"\")","v":""},{"$f":"IF('Systems Request'!I30<>\"\",'Systems Request'!I30,\"\")","v":""},{"$f":"IF('Systems Request'!J30<>\"\",'Systems Request'!J30,\"\")","v":""},{"$f":"IF('Systems Request'!K30<>\"\",'Systems Request'!K30,\"\")","v":""},{"$f":"IF('Systems Request'!L30<>\"\",'Systems Request'!L30,\"\")","v":""},{"$f":"IF('Systems Request'!O30<>\"\",'Systems Request'!O30,\"\")","v":""},{"$f":"IF('Systems Request'!N30<>\"\",'Systems Request'!N30,\"\")","v":""},{"$f":"IF('Systems Request'!R30<>\"\",'Systems Request'!R30,\"\")","v":""},{"$f":"IF('Systems Request'!Q30<>\"\",'Systems Request'!Q30,\"\")","v":""},{"$f":"IF('Systems Request'!S30<>\"\",'Systems Request'!S30,\"\")","v":""},{"$f":"IF('Systems Request'!T30<>\"\",'Systems Request'!T30,\"\")","v":"Select Job Function"},{"$f":"IF('Systems Request'!Q30<>\"\",'Systems Request'!S$9,\"\")","v":""},{"$f":"IF('Systems Request'!Q30<>\"\",'Systems Request'!$S$11,\"\")","v":""},{"$f":"IF('Systems Request'!Q30<>\"\",'Systems Request'!$H$9,\"\")","v":""},{"$f":"IF('Systems Request'!Q30<>\"\",'Systems Request'!$H$10,\"\")","v":""},{"$f":"IF('Systems Request'!Q30<>\"\",'Systems Request'!$H$11,\"\")","v":""},{"$f":"IF('Systems Request'!Q30<>\"\",'Systems Request'!$H$12,\"\")","v":""},{"$f":"IF('Systems Request'!Q30<>\"\",'Systems Request'!$H$13,\"\")","v":""},{"$f":"IF('Systems Request'!Q30<>\"\",'Systems Request'!$H$14,\"\")","v":""},{"$f":"IF('Systems Request'!Q30<>\"\",'Systems Request'!$U$30,\"\")","v":""},{"$f":"IF('Systems Request'!Q30<>\"\",'Systems Request'!$V$30,\"\")","v":""},{"$f":"IF('Systems Request'!Q30<>\"\",'Systems Request'!$R$10,\"\")","v":""},{"$f":"IF('Systems Request'!Q30<>\"\",\"Assign Mainframe ID\",\"\")","v":""}]
[{"$f":"IF('Systems Request'!C31<>\"\",'Systems Request'!C31,\"\")","v":""},{"$f":"IF('Systems Request'!D31<>\"\",'Systems Request'!D31,\"\")","v":""},{"$f":"IF('Systems Request'!E31<>\"\",'Systems Request'!E31,\"\")","v":""},{"$f":"IF('Systems Request'!F31<>\"\",'Systems Request'!F31,\"\")","v":""},{"$f":"IF('Systems Request'!G31<>\"\",'Systems Request'!G31,\"\")","v":""},{"$f":"IF('Systems Request'!M31<>\"\",'Systems Request'!M31,\"\")","v":""},{"$f":"IF('Systems Request'!H31<>\"\",'Systems Request'!H31,\"\")","v":""},{"$f":"IF('Systems Request'!I31<>\"\",'Systems Request'!I31,\"\")","v":""},{"$f":"IF('Systems Request'!J31<>\"\",'Systems Request'!J31,\"\")","v":""},{"$f":"IF('Systems Request'!K31<>\"\",'Systems Request'!K31,\"\")","v":""},{"$f":"IF('Systems Request'!L31<>\"\",'Systems Request'!L31,\"\")","v":""},{"$f":"IF('Systems Request'!O31<>\"\",'Systems Request'!O31,\"\")","v":""},{"$f":"IF('Systems Request'!N31<>\"\",'Systems Request'!N31,\"\")","v":""},{"$f":"IF('Systems Request'!R31<>\"\",'Systems Request'!R31,\"\")","v":""},{"$f":"IF('Systems Request'!Q31<>\"\",'Systems Request'!Q31,\"\")","v":""},{"$f":"IF('Systems Request'!S31<>\"\",'Systems Request'!S31,\"\")","v":""},{"$f":"IF('Systems Request'!T31<>\"\",'Systems Request'!T31,\"\")","v":"Select Job Function"},{"$f":"IF('Systems Request'!Q31<>\"\",'Systems Request'!S$9,\"\")","v":""},{"$f":"IF('Systems Request'!Q31<>\"\",'Systems Request'!$S$11,\"\")","v":""},{"$f":"IF('Systems Request'!Q31<>\"\",'Systems Request'!$H$9,\"\")","v":""},{"$f":"IF('Systems Request'!Q31<>\"\",'Systems Request'!$H$10,\"\")","v":""},{"$f":"IF('Systems Request'!Q31<>\"\",'Systems Request'!$H$11,\"\")","v":""},{"$f":"IF('Systems Request'!Q31<>\"\",'Systems Request'!$H$12,\"\")","v":""},{"$f":"IF('Systems Request'!Q31<>\"\",'Systems Request'!$H$13,\"\")","v":""},{"$f":"IF('Systems Request'!Q31<>\"\",'Systems Request'!$H$14,\"\")","v":""},{"$f":"IF('Systems Request'!Q31<>\"\",'Systems Request'!$U$31,\"\")","v":""},{"$f":"IF('Systems Request'!Q31<>\"\",'Systems Request'!$V$31,\"\")","v":""},{"$f":"IF('Systems Request'!Q31<>\"\",'Systems Request'!$R$10,\"\")","v":""},{"$f":"IF('Systems Request'!Q31<>\"\",\"Assign Mainframe ID\",\"\")","v":""}]
[{"$f":"IF('Systems Request'!C32<>\"\",'Systems Request'!C32,\"\")","v":""},{"$f":"IF('Systems Request'!D32<>\"\",'Systems Request'!D32,\"\")","v":""},{"$f":"IF('Systems Request'!E32<>\"\",'Systems Request'!E32,\"\")","v":""},{"$f":"IF('Systems Request'!F32<>\"\",'Systems Request'!F32,\"\")","v":""},{"$f":"IF('Systems Request'!G32<>\"\",'Systems Request'!G32,\"\")","v":""},{"$f":"IF('Systems Request'!M32<>\"\",'Systems Request'!M32,\"\")","v":""},{"$f":"IF('Systems Request'!H32<>\"\",'Systems Request'!H32,\"\")","v":""},{"$f":"IF('Systems Request'!I32<>\"\",'Systems Request'!I32,\"\")","v":""},{"$f":"IF('Systems Request'!J32<>\"\",'Systems Request'!J32,\"\")","v":""},{"$f":"IF('Systems Request'!K32<>\"\",'Systems Request'!K32,\"\")","v":""},{"$f":"IF('Systems Request'!L32<>\"\",'Systems Request'!L32,\"\")","v":""},{"$f":"IF('Systems Request'!O32<>\"\",'Systems Request'!O32,\"\")","v":""},{"$f":"IF('Systems Request'!N32<>\"\",'Systems Request'!N32,\"\")","v":""},{"$f":"IF('Systems Request'!R32<>\"\",'Systems Request'!R32,\"\")","v":""},{"$f":"IF('Systems Request'!Q32<>\"\",'Systems Request'!Q32,\"\")","v":""},{"$f":"IF('Systems Request'!S32<>\"\",'Systems Request'!S32,\"\")","v":""},{"$f":"IF('Systems Request'!T32<>\"\",'Systems Request'!T32,\"\")","v":"Select Job Function"},{"$f":"IF('Systems Request'!Q32<>\"\",'Systems Request'!S$9,\"\")","v":""},{"$f":"IF('Systems Request'!Q32<>\"\",'Systems Request'!$S$11,\"\")","v":""},{"$f":"IF('Systems Request'!Q32<>\"\",'Systems Request'!$H$9,\"\")","v":""},{"$f":"IF('Systems Request'!Q32<>\"\",'Systems Request'!$H$10,\"\")","v":""},{"$f":"IF('Systems Request'!Q32<>\"\",'Systems Request'!$H$11,\"\")","v":""},{"$f":"IF('Systems Request'!Q32<>\"\",'Systems Request'!$H$12,\"\")","v":""},{"$f":"IF('Systems Request'!Q32<>\"\",'Systems Request'!$H$13,\"\")","v":""},{"$f":"IF('Systems Request'!Q32<>\"\",'Systems Request'!$H$14,\"\")","v":""},{"$f":"IF('Systems Request'!Q32<>\"\",'Systems Request'!$U$32,\"\")","v":""},{"$f":"IF('Systems Request'!Q32<>\"\",'Systems Request'!$V$32,\"\")","v":""},{"$f":"IF('Systems Request'!Q32<>\"\",'Systems Request'!$R$10,\"\")","v":""},{"$f":"IF('Systems Request'!Q32<>\"\",\"Assign Mainframe ID\",\"\")","v":""}]
[{"$f":"IF('Systems Request'!C33<>\"\",'Systems Request'!C33,\"\")","v":""},{"$f":"IF('Systems Request'!D33<>\"\",'Systems Request'!D33,\"\")","v":""},{"$f":"IF('Systems Request'!E33<>\"\",'Systems Request'!E33,\"\")","v":""},{"$f":"IF('Systems Request'!F33<>\"\",'Systems Request'!F33,\"\")","v":""},{"$f":"IF('Systems Request'!G33<>\"\",'Systems Request'!G33,\"\")","v":""},{"$f":"IF('Systems Request'!M33<>\"\",'Systems Request'!M33,\"\")","v":""},{"$f":"IF('Systems Request'!H33<>\"\",'Systems Request'!H33,\"\")","v":""},{"$f":"IF('Systems Request'!I33<>\"\",'Systems Request'!I33,\"\")","v":""},{"$f":"IF('Systems Request'!J33<>\"\",'Systems Request'!J33,\"\")","v":""},{"$f":"IF('Systems Request'!K33<>\"\",'Systems Request'!K33,\"\")","v":""},{"$f":"IF('Systems Request'!L33<>\"\",'Systems Request'!L33,\"\")","v":""},{"$f":"IF('Systems Request'!O33<>\"\",'Systems Request'!O33,\"\")","v":""},{"$f":"IF('Systems Request'!N33<>\"\",'Systems Request'!N33,\"\")","v":""},{"$f":"IF('Systems Request'!R33<>\"\",'Systems Request'!R33,\"\")","v":""},{"$f":"IF('Systems Request'!Q33<>\"\",'Systems Request'!Q33,\"\")","v":""},{"$f":"IF('Systems Request'!S33<>\"\",'Systems Request'!S33,\"\")","v":""},{"$f":"IF('Systems Request'!T33<>\"\",'Systems Request'!T33,\"\")","v":"Select Job Function"},{"$f":"IF('Systems Request'!Q33<>\"\",'Systems Request'!S$9,\"\")","v":""},{"$f":"IF('Systems Request'!Q33<>\"\",'Systems Request'!$S$11,\"\")","v":""},{"$f":"IF('Systems Request'!Q33<>\"\",'Systems Request'!$H$9,\"\")","v":""},{"$f":"IF('Systems Request'!Q33<>\"\",'Systems Request'!$H$10,\"\")","v":""},{"$f":"IF('Systems Request'!Q33<>\"\",'Systems Request'!$H$11,\"\")","v":""},{"$f":"IF('Systems Request'!Q33<>\"\",'Systems Request'!$H$12,\"\")","v":""},{"$f":"IF('Systems Request'!Q33<>\"\",'Systems Request'!$H$13,\"\")","v":""},{"$f":"IF('Systems Request'!Q33<>\"\",'Systems Request'!$H$14,\"\")","v":""},{"$f":"IF('Systems Request'!Q33<>\"\",'Systems Request'!$U$33,\"\")","v":""},{"$f":"IF('Systems Request'!Q33<>\"\",'Systems Request'!$V$33,\"\")","v":""},{"$f":"IF('Systems Request'!Q33<>\"\",'Systems Request'!$R$10,\"\")","v":""},{"$f":"IF('Systems Request'!Q33<>\"\",\"Assign Mainframe ID\",\"\")","v":""}]
[{"$f":"IF('Systems Request'!C34<>\"\",'Systems Request'!C34,\"\")","v":""},{"$f":"IF('Systems Request'!D34<>\"\",'Systems Request'!D34,\"\")","v":""},{"$f":"IF('Systems Request'!E34<>\"\",'Systems Request'!E34,\"\")","v":""},{"$f":"IF('Systems Request'!F34<>\"\",'Systems Request'!F34,\"\")","v":""},{"$f":"IF('Systems Request'!G34<>\"\",'Systems Request'!G34,\"\")","v":""},{"$f":"IF('Systems Request'!M34<>\"\",'Systems Request'!M34,\"\")","v":""},{"$f":"IF('Systems Request'!H34<>\"\",'Systems Request'!H34,\"\")","v":""},{"$f":"IF('Systems Request'!I34<>\"\",'Systems Request'!I34,\"\")","v":""},{"$f":"IF('Systems Request'!J34<>\"\",'Systems Request'!J34,\"\")","v":""},{"$f":"IF('Systems Request'!K34<>\"\",'Systems Request'!K34,\"\")","v":""},{"$f":"IF('Systems Request'!L34<>\"\",'Systems Request'!L34,\"\")","v":""},{"$f":"IF('Systems Request'!O34<>\"\",'Systems Request'!O34,\"\")","v":""},{"$f":"IF('Systems Request'!N34<>\"\",'Systems Request'!N34,\"\")","v":""},{"$f":"IF('Systems Request'!R34<>\"\",'Systems Request'!R34,\"\")","v":""},{"$f":"IF('Systems Request'!Q34<>\"\",'Systems Request'!Q34,\"\")","v":""},{"$f":"IF('Systems Request'!S34<>\"\",'Systems Request'!S34,\"\")","v":""},{"$f":"IF('Systems Request'!T34<>\"\",'Systems Request'!T34,\"\")","v":"Select Job Function"},{"$f":"IF('Systems Request'!Q34<>\"\",'Systems Request'!S$9,\"\")","v":""},{"$f":"IF('Systems Request'!Q34<>\"\",'Systems Request'!$S$11,\"\")","v":""},{"$f":"IF('Systems Request'!Q34<>\"\",'Systems Request'!$H$9,\"\")","v":""},{"$f":"IF('Systems Request'!Q34<>\"\",'Systems Request'!$H$10,\"\")","v":""},{"$f":"IF('Systems Request'!Q34<>\"\",'Systems Request'!$H$11,\"\")","v":""},{"$f":"IF('Systems Request'!Q34<>\"\",'Systems Request'!$H$12,\"\")","v":""},{"$f":"IF('Systems Request'!Q34<>\"\",'Systems Request'!$H$13,\"\")","v":""},{"$f":"IF('Systems Request'!Q34<>\"\",'Systems Request'!$H$14,\"\")","v":""},{"$f":"IF('Systems Request'!Q34<>\"\",'Systems Request'!$U$34,\"\")","v":""},{"$f":"IF('Systems Request'!Q34<>\"\",'Systems Request'!$V$34,\"\")","v":""},{"$f":"IF('Systems Request'!Q34<>\"\",'Systems Request'!$R$10,\"\")","v":""},{"$f":"IF('Systems Request'!Q34<>\"\",\"Assign Mainframe ID\",\"\")","v":""}]
[{"$f":"IF('Systems Request'!J35=\"X\",\"X\",\"\")","v":""},{"$f":"IF('Systems Request'!K35=\"X\",\"X\",\"\")","v":""},{"$f":"IF('Systems Request'!L35=\"X\",\"X\",\"\")","v":""},{"$f":"IF('Systems Request'!M35=\"X\",\"X\",\"\")","v":""},{"$f":"IF('Systems Request'!N35=\"X\",\"X\",\"\")","v":""},{"$f":"IF('Systems Request'!O35=\"X\",\"X\",\"\")","v":""},{"$f":"IF('Systems Request'!P35=\"X\",\"X\",\"\")","v":""},{"$f":"IF('Systems Request'!Q35=\"X\",\"X\",\"\")","v":""},{"$f":"IF('Systems Request'!R35=\"X\",\"X\",\"\")","v":""},{"$f":"IF('Systems Request'!S35=\"X\",\"X\",\"\")","v":""},{"$f":"IF('Systems Request'!T35=\"X\",\"X\",\"\")","v":""},{"$f":"IF('Systems Request'!U35=\"X\",\"X\",\"\")","v":""},{"$f":"IF('Systems Request'!V35=\"X\",\"X\",\"\")","v":""},{"$f":"IF('Systems Request'!Q35<>\"\",'Systems Request'!Q35,\"\")","v":""},{"$f":"IF('Systems Request'!P35<>\"\",'Systems Request'!P35,\"\")","v":""},{"$f":"IF('Systems Request'!R35<>\"\",'Systems Request'!R35,\"\")","v":""},{"$f":"IF('Systems Request'!S35<>\"\",'Systems Request'!S35,\"\")","v":""},{"$f":"IF('Systems Request'!P35<>\"\",'Systems Request'!S$9,\"\")","v":""},{"$f":"IF('Systems Request'!P35<>\"\",'Systems Request'!$S$11,\"\")","v":""},{"$f":"IF('Systems Request'!P35<>\"\",'Systems Request'!$H$9,\"\")","v":""},{"$f":"IF('Systems Request'!P35<>\"\",'Systems Request'!$H$10,\"\")","v":""},{"$f":"IF('Systems Request'!P35<>\"\",'Systems Request'!$H$11,\"\")","v":""},{"$f":"IF('Systems Request'!P35<>\"\",'Systems Request'!$H$12,\"\")","v":""},{"$f":"IF('Systems Request'!P35<>\"\",'Systems Request'!$H$13,\"\")","v":""},{"$f":"IF('Systems Request'!P35<>\"\",'Systems Request'!$H$14,\"\")","v":""},{"$f":"IF('Systems Request'!P35<>\"\",'Systems Request'!$T$35,\"\")","v":""},{"$f":"IF('Systems Request'!P35<>\"\",'Systems Request'!$U$35,\"\")","v":""},{"$f":"IF('Systems Request'!P35<>\"\",'Systems Request'!$R$10,\"\")","v":""},{"$f":"IF('Systems Request'!P35<>\"\",\"Assign Mainframe ID\",\"\")","v":""}]
[{"$f":"IF('Systems Request'!J36=\"X\",\"X\",\"\")","v":""},{"$f":"IF('Systems Request'!K36=\"X\",\"X\",\"\")","v":""},{"$f":"IF('Systems Request'!L36=\"X\",\"X\",\"\")","v":""},{"$f":"IF('Systems Request'!M36=\"X\",\"X\",\"\")","v":""},{"$f":"IF('Systems Request'!N36=\"X\",\"X\",\"\")","v":""},{"$f":"IF('Systems Request'!O36=\"X\",\"X\",\"\")","v":""},{"$f":"IF('Systems Request'!P36=\"X\",\"X\",\"\")","v":""},{"$f":"IF('Systems Request'!Q36=\"X\",\"X\",\"\")","v":""},{"$f":"IF('Systems Request'!R36=\"X\",\"X\",\"\")","v":""},{"$f":"IF('Systems Request'!S36=\"X\",\"X\",\"\")","v":""},{"$f":"IF('Systems Request'!T36=\"X\",\"X\",\"\")","v":""},{"$f":"IF('Systems Request'!U36=\"X\",\"X\",\"\")","v":""},{"$f":"IF('Systems Request'!V36=\"X\",\"X\",\"\")","v":""},{"$f":"IF('Systems Request'!Q36<>\"\",'Systems Request'!Q36,\"\")","v":""},{"$f":"IF('Systems Request'!P36<>\"\",'Systems Request'!P36,\"\")","v":""},{"$f":"IF('Systems Request'!R36<>\"\",'Systems Request'!R36,\"\")","v":""},{"$f":"IF('Systems Request'!S36<>\"\",'Systems Request'!S36,\"\")","v":""},{"$f":"IF('Systems Request'!P36<>\"\",'Systems Request'!S$9,\"\")","v":""},{"$f":"IF('Systems Request'!P36<>\"\",'Systems Request'!$S$11,\"\")","v":""},{"$f":"IF('Systems Request'!P36<>\"\",'Systems Request'!$H$9,\"\")","v":""},{"$f":"IF('Systems Request'!P36<>\"\",'Systems Request'!$H$10,\"\")","v":""},{"$f":"IF('Systems Request'!P36<>\"\",'Systems Request'!$H$11,\"\")","v":""},{"$f":"IF('Systems Request'!P36<>\"\",'Systems Request'!$H$12,\"\")","v":""},{"$f":"IF('Systems Request'!P36<>\"\",'Systems Request'!$H$13,\"\")","v":""},{"$f":"IF('Systems Request'!P36<>\"\",'Systems Request'!$H$14,\"\")","v":""},{"$f":"IF('Systems Request'!P36<>\"\",'Systems Request'!$T$36,\"\")","v":""},{"$f":"IF('Systems Request'!P36<>\"\",'Systems Request'!$U$36,\"\")","v":""},{"$f":"IF('Systems Request'!P36<>\"\",'Systems Request'!$R$10,\"\")","v":""},{"$f":"IF('Systems Request'!P36<>\"\",\"Assign Mainframe ID\",\"\")","v":""}]
[{"$f":"IF('Systems Request'!J37=\"X\",\"X\",\"\")","v":""},{"$f":"IF('Systems Request'!K37=\"X\",\"X\",\"\")","v":""},{"$f":"IF('Systems Request'!L37=\"X\",\"X\",\"\")","v":""},{"$f":"IF('Systems Request'!M37=\"X\",\"X\",\"\")","v":""},{"$f":"IF('Systems Request'!N37=\"X\",\"X\",\"\")","v":""},{"$f":"IF('Systems Request'!O37=\"X\",\"X\",\"\")","v":""},{"$f":"IF('Systems Request'!P37=\"X\",\"X\",\"\")","v":""},{"$f":"IF('Systems Request'!Q37=\"X\",\"X\",\"\")","v":""},{"$f":"IF('Systems Request'!R37=\"X\",\"X\",\"\")","v":""},{"$f":"IF('Systems Request'!S37=\"X\",\"X\",\"\")","v":""},{"$f":"IF('Systems Request'!T37=\"X\",\"X\",\"\")","v":""},{"$f":"IF('Systems Request'!U37=\"X\",\"X\",\"\")","v":""},{"$f":"IF('Systems Request'!V37=\"X\",\"X\",\"\")","v":""},{"$f":"IF('Systems Request'!Q37<>\"\",'Systems Request'!Q37,\"\")","v":""},{"$f":"IF('Systems Request'!P37<>\"\",'Systems Request'!P37,\"\")","v":""},{"$f":"IF('Systems Request'!R37<>\"\",'Systems Request'!R37,\"\")","v":""},{"$f":"IF('Systems Request'!S37<>\"\",'Systems Request'!S37,\"\")","v":""},{"$f":"IF('Systems Request'!P37<>\"\",'Systems Request'!S$9,\"\")","v":""},{"$f":"IF('Systems Request'!P37<>\"\",'Systems Request'!$S$11,\"\")","v":""},{"$f":"IF('Systems Request'!P37<>\"\",'Systems Request'!$H$9,\"\")","v":""},{"$f":"IF('Systems Request'!P37<>\"\",'Systems Request'!$H$10,\"\")","v":""},{"$f":"IF('Systems Request'!P37<>\"\",'Systems Request'!$H$11,\"\")","v":""},{"$f":"IF('Systems Request'!P37<>\"\",'Systems Request'!$H$12,\"\")","v":""},{"$f":"IF('Systems Request'!P37<>\"\",'Systems Request'!$H$13,\"\")","v":""},{"$f":"IF('Systems Request'!P37<>\"\",'Systems Request'!$H$14,\"\")","v":""},{"$f":"IF('Systems Request'!P37<>\"\",'Systems Request'!$T$37,\"\")","v":""},{"$f":"IF('Systems Request'!P37<>\"\",'Systems Request'!$U$37,\"\")","v":""},{"$f":"IF('Systems Request'!P37<>\"\",'Systems Request'!$R$10,\"\")","v":""},{"$f":"IF('Systems Request'!P37<>\"\",\"Assign Mainframe ID\",\"\")","v":""}]
[{"$f":"IF('Systems Request'!#REF!=\"X\",\"X\",\"\")","v":{"$error":"#REF!"}},{"$f":"IF('Systems Request'!#REF!=\"X\",\"X\",\"\")","v":{"$error":"#REF!"}},{"$f":"IF('Systems Request'!#REF!=\"X\",\"X\",\"\")","v":{"$error":"#REF!"}},{"$f":"IF('Systems Request'!#REF!=\"X\",\"X\",\"\")","v":{"$error":"#REF!"}},{"$f":"IF('Systems Request'!#REF!=\"X\",\"X\",\"\")","v":{"$error":"#REF!"}},{"$f":"IF('Systems Request'!#REF!=\"X\",\"X\",\"\")","v":{"$error":"#REF!"}},{"$f":"IF('Systems Request'!#REF!=\"X\",\"X\",\"\")","v":{"$error":"#REF!"}},{"$f":"IF('Systems Request'!#REF!=\"X\",\"X\",\"\")","v":{"$error":"#REF!"}},{"$f":"IF('Systems Request'!#REF!=\"X\",\"X\",\"\")","v":{"$error":"#REF!"}},{"$f":"IF('Systems Request'!#REF!=\"X\",\"X\",\"\")","v":{"$error":"#REF!"}},{"$f":"IF('Systems Request'!#REF!=\"X\",\"X\",\"\")","v":{"$error":"#REF!"}},{"$f":"IF('Systems Request'!#REF!=\"X\",\"X\",\"\")","v":{"$error":"#REF!"}},{"$f":"IF('Systems Request'!#REF!=\"X\",\"X\",\"\")","v":{"$error":"#REF!"}},{"$f":"IF('Systems Request'!#REF!<>\"\",'Systems Request'!#REF!,\"\")","v":{"$error":"#REF!"}},{"$f":"IF('Systems Request'!#REF!<>\"\",'Systems Request'!#REF!,\"\")","v":{"$error":"#REF!"}},{"$f":"IF('Systems Request'!#REF!<>\"\",'Systems Request'!#REF!,\"\")","v":{"$error":"#REF!"}},{"$f":"IF('Systems Request'!#REF!<>\"\",'Systems Request'!#REF!,\"\")","v":{"$error":"#REF!"}},{"$f":"IF('Systems Request'!#REF!<>\"\",'Systems Request'!S$9,\"\")","v":{"$error":"#REF!"}},{"$f":"IF('Systems Request'!#REF!<>\"\",'Systems Request'!$S$11,\"\")","v":{"$error":"#REF!"}},{"$f":"IF('Systems Request'!#REF!<>\"\",'Systems Request'!$H$9,\"\")","v":{"$error":"#REF!"}},{"$f":"IF('Systems Request'!#REF!<>\"\",'Systems Request'!$H$10,\"\")","v":{"$error":"#REF!"}},{"$f":"IF('Systems Request'!#REF!<>\"\",'Systems Request'!$H$11,\"\")","v":{"$error":"#REF!"}},{"$f":"IF('Systems Request'!#REF!<>\"\",'Systems Request'!$H$12,\"\")","v":{"$error":"#REF!"}},{"$f":"IF('Systems Request'!#REF!<>\"\",'Systems Request'!$H$13,\"\")","v":{"$error":"#REF!"}},{"$f":"IF('Systems Request'!#REF!<>\"\",'Systems Request'!$H$14,\"\")","v":{"$error":"#REF!"}},{"$f":"IF('Systems Request'!#REF!<>\"\",'Systems Request'!#REF!,\"\")","v":{"$error":"#REF!"}},{"$f":"IF('Systems Request'!#REF!<>\"\",'Systems Request'!#REF!,\"\")","v":{"$error":"#REF!"}},{"$f":"IF('Systems Request'!#REF!<>\"\",'Systems Request'!$R$10,\"\")","v":{"$error":"#REF!"}},{"$f":"IF('Systems Request'!#REF!<>\"\",\"Assign Mainframe ID\",\"\")","v":{"$error":"#REF!"}}]
[{"$f":"IF('Systems Request'!J38=\"X\",\"X\",\"\")","v":""},{"$f":"IF('Systems Request'!K38=\"X\",\"X\",\"\")","v":""},{"$f":"IF('Systems Request'!L38=\"X\",\"X\",\"\")","v":""},{"$f":"IF('Systems Request'!M38=\"X\",\"X\",\"\")","v":""},{"$f":"IF('Systems Request'!N38=\"X\",\"X\",\"\")","v":""},{"$f":"IF('Systems Request'!O38=\"X\",\"X\",\"\")","v":""},{"$f":"IF('Systems Request'!P38=\"X\",\"X\",\"\")","v":""},{"$f":"IF('Systems Request'!Q38=\"X\",\"X\",\"\")","v":""},{"$f":"IF('Systems Request'!R38=\"X\",\"X\",\"\")","v":""},{"$f":"IF('Systems Request'!S38=\"X\",\"X\",\"\")","v":""},{"$f":"IF('Systems Request'!T38=\"X\",\"X\",\"\")","v":""},{"$f":"IF('Systems Request'!U38=\"X\",\"X\",\"\")","v":""},{"$f":"IF('Systems Request'!V38=\"X\",\"X\",\"\")","v":""},{"$f":"IF('Systems Request'!Q38<>\"\",'Systems Request'!Q38,\"\")","v":""},{"$f":"IF('Systems Request'!P38<>\"\",'Systems Request'!P38,\"\")","v":""},{"$f":"IF('Systems Request'!R38<>\"\",'Systems Request'!R38,\"\")","v":""},{"$f":"IF('Systems Request'!S38<>\"\",'Systems Request'!S38,\"\")","v":""},{"$f":"IF('Systems Request'!P38<>\"\",'Systems Request'!S$9,\"\")","v":""},{"$f":"IF('Systems Request'!P38<>\"\",'Systems Request'!$S$11,\"\")","v":""},{"$f":"IF('Systems Request'!P38<>\"\",'Systems Request'!$H$9,\"\")","v":""},{"$f":"IF('Systems Request'!P38<>\"\",'Systems Request'!$H$10,\"\")","v":""},{"$f":"IF('Systems Request'!P38<>\"\",'Systems Request'!$H$11,\"\")","v":""},{"$f":"IF('Systems Request'!P38<>\"\",'Systems Request'!$H$12,\"\")","v":""},{"$f":"IF('Systems Request'!P38<>\"\",'Systems Request'!$H$13,\"\")","v":""},{"$f":"IF('Systems Request'!P38<>\"\",'Systems Request'!$H$14,\"\")","v":""},{"$f":"IF('Systems Request'!P38<>\"\",'Systems Request'!$T$38,\"\")","v":""},{"$f":"IF('Systems Request'!P38<>\"\",'Systems Request'!$U$38,\"\")","v":""},{"$f":"IF('Systems Request'!P38<>\"\",'Systems Request'!$R$10,\"\")","v":""},{"$f":"IF('Systems Request'!P38<>\"\",\"Assign Mainframe ID\",\"\")","v":""}]
[{"$f":"IF('Systems Request'!J39=\"X\",\"X\",\"\")","v":""},{"$f":"IF('Systems Request'!K39=\"X\",\"X\",\"\")","v":""},{"$f":"IF('Systems Request'!L39=\"X\",\"X\",\"\")","v":""},{"$f":"IF('Systems Request'!M39=\"X\",\"X\",\"\")","v":""},{"$f":"IF('Systems Request'!N39=\"X\",\"X\",\"\")","v":""},{"$f":"IF('Systems Request'!O39=\"X\",\"X\",\"\")","v":""},{"$f":"IF('Systems Request'!P39=\"X\",\"X\",\"\")","v":""},{"$f":"IF('Systems Request'!Q39=\"X\",\"X\",\"\")","v":""},{"$f":"IF('Systems Request'!R39=\"X\",\"X\",\"\")","v":""},{"$f":"IF('Systems Request'!S39=\"X\",\"X\",\"\")","v":""},{"$f":"IF('Systems Request'!T39=\"X\",\"X\",\"\")","v":""},{"$f":"IF('Systems Request'!U39=\"X\",\"X\",\"\")","v":""},{"$f":"IF('Systems Request'!V39=\"X\",\"X\",\"\")","v":""},{"$f":"IF('Systems Request'!Q39<>\"\",'Systems Request'!Q39,\"\")","v":""},{"$f":"IF('Systems Request'!P39<>\"\",'Systems Request'!P39,\"\")","v":""},{"$f":"IF('Systems Request'!R39<>\"\",'Systems Request'!R39,\"\")","v":""},{"$f":"IF('Systems Request'!S39<>\"\",'Systems Request'!S39,\"\")","v":""},{"$f":"IF('Systems Request'!P39<>\"\",'Systems Request'!S$9,\"\")","v":""},{"$f":"IF('Systems Request'!P39<>\"\",'Systems Request'!$S$11,\"\")","v":""},{"$f":"IF('Systems Request'!P39<>\"\",'Systems Request'!$H$9,\"\")","v":""},{"$f":"IF('Systems Request'!P39<>\"\",'Systems Request'!$H$10,\"\")","v":""},{"$f":"IF('Systems Request'!P39<>\"\",'Systems Request'!$H$11,\"\")","v":""},{"$f":"IF('Systems Request'!P39<>\"\",'Systems Request'!$H$12,\"\")","v":""},{"$f":"IF('Systems Request'!P39<>\"\",'Systems Request'!$H$13,\"\")","v":""},{"$f":"IF('Systems Request'!P39<>\"\",'Systems Request'!$H$14,\"\")","v":""},{"$f":"IF('Systems Request'!P39<>\"\",'Systems Request'!$T$39,\"\")","v":""},{"$f":"IF('Systems Request'!P39<>\"\",'Systems Request'!$U$39,\"\")","v":""},{"$f":"IF('Systems Request'!P39<>\"\",'Systems Request'!$R$10,\"\")","v":""},{"$f":"IF('Systems Request'!P39<>\"\",\"Assign Mainframe ID\",\"\")","v":""}]
[{"$f":"IF('Systems Request'!J40=\"X\",\"X\",\"\")","v":""},{"$f":"IF('Systems Request'!K40=\"X\",\"X\",\"\")","v":""},{"$f":"IF('Systems Request'!L40=\"X\",\"X\",\"\")","v":""},{"$f":"IF('Systems Request'!M40=\"X\",\"X\",\"\")","v":""},{"$f":"IF('Systems Request'!N40=\"X\",\"X\",\"\")","v":""},{"$f":"IF('Systems Request'!O40=\"X\",\"X\",\"\")","v":""},{"$f":"IF('Systems Request'!P40=\"X\",\"X\",\"\")","v":""},{"$f":"IF('Systems Request'!Q40=\"X\",\"X\",\"\")","v":""},{"$f":"IF('Systems Request'!R40=\"X\",\"X\",\"\")","v":""},{"$f":"IF('Systems Request'!S40=\"X\",\"X\",\"\")","v":""},{"$f":"IF('Systems Request'!T40=\"X\",\"X\",\"\")","v":""},{"$f":"IF('Systems Request'!U40=\"X\",\"X\",\"\")","v":""},{"$f":"IF('Systems Request'!V40=\"X\",\"X\",\"\")","v":""},{"$f":"IF('Systems Request'!Q40<>\"\",'Systems Request'!Q40,\"\")","v":""},{"$f":"IF('Systems Request'!P40<>\"\",'Systems Request'!P40,\"\")","v":""},{"$f":"IF('Systems Request'!R40<>\"\",'Systems Request'!R40,\"\")","v":""},{"$f":"IF('Systems Request'!S40<>\"\",'Systems Request'!S40,\"\")","v":""},{"$f":"IF('Systems Request'!P40<>\"\",'Systems Request'!S$9,\"\")","v":""},{"$f":"IF('Systems Request'!P40<>\"\",'Systems Request'!$S$11,\"\")","v":""},{"$f":"IF('Systems Request'!P40<>\"\",'Systems Request'!$H$9,\"\")","v":""},{"$f":"IF('Systems Request'!P40<>\"\",'Systems Request'!$H$10,\"\")","v":""},{"$f":"IF('Systems Request'!P40<>\"\",'Systems Request'!$H$11,\"\")","v":""},{"$f":"IF('Systems Request'!P40<>\"\",'Systems Request'!$H$12,\"\")","v":""},{"$f":"IF('Systems Request'!P40<>\"\",'Systems Request'!$H$13,\"\")","v":""},{"$f":"IF('Systems Request'!P40<>\"\",'Systems Request'!$H$14,\"\")","v":""},{"$f":"IF('Systems Request'!P40<>\"\",'Systems Request'!$T$40,\"\")","v":""},{"$f":"IF('Systems Request'!P40<>\"\",'Systems Request'!$U$40,\"\")","v":""},{"$f":"IF('Systems Request'!P40<>\"\",'Systems Request'!$R$10,\"\")","v":""},{"$f":"IF('Systems Request'!P40<>\"\",\"Assign Mainframe ID\",\"\")","v":""}]
[{"$f":"IF('Systems Request'!J41=\"X\",\"X\",\"\")","v":""},{"$f":"IF('Systems Request'!K41=\"X\",\"X\",\"\")","v":""},{"$f":"IF('Systems Request'!L41=\"X\",\"X\",\"\")","v":""},{"$f":"IF('Systems Request'!M41=\"X\",\"X\",\"\")","v":""},{"$f":"IF('Systems Request'!N41=\"X\",\"X\",\"\")","v":""},{"$f":"IF('Systems Request'!O41=\"X\",\"X\",\"\")","v":""},{"$f":"IF('Systems Request'!P41=\"X\",\"X\",\"\")","v":""},{"$f":"IF('Systems Request'!Q41=\"X\",\"X\",\"\")","v":""},{"$f":"IF('Systems Request'!R41=\"X\",\"X\",\"\")","v":""},{"$f":"IF('Systems Request'!S41=\"X\",\"X\",\"\")","v":""},{"$f":"IF('Systems Request'!T41=\"X\",\"X\",\"\")","v":""},{"$f":"IF('Systems Request'!U41=\"X\",\"X\",\"\")","v":""},{"$f":"IF('Systems Request'!V41=\"X\",\"X\",\"\")","v":""},{"$f":"IF('Systems Request'!Q41<>\"\",'Systems Request'!Q41,\"\")","v":""},{"$f":"IF('Systems Request'!P41<>\"\",'Systems Request'!P41,\"\")","v":""},{"$f":"IF('Systems Request'!R41<>\"\",'Systems Request'!R41,\"\")","v":""},{"$f":"IF('Systems Request'!S41<>\"\",'Systems Request'!S41,\"\")","v":""},{"$f":"IF('Systems Request'!P41<>\"\",'Systems Request'!S$9,\"\")","v":""},{"$f":"IF('Systems Request'!P41<>\"\",'Systems Request'!$S$11,\"\")","v":""},{"$f":"IF('Systems Request'!P41<>\"\",'Systems Request'!$H$9,\"\")","v":""},{"$f":"IF('Systems Request'!P41<>\"\",'Systems Request'!$H$10,\"\")","v":""},{"$f":"IF('Systems Request'!P41<>\"\",'Systems Request'!$H$11,\"\")","v":""},{"$f":"IF('Systems Request'!P41<>\"\",'Systems Request'!$H$12,\"\")","v":""},{"$f":"IF('Systems Request'!P41<>\"\",'Systems Request'!$H$13,\"\")","v":""},{"$f":"IF('Systems Request'!P41<>\"\",'Systems Request'!$H$14,\"\")","v":""},{"$f":"IF('Systems Request'!P41<>\"\",'Systems Request'!$T$41,\"\")","v":""},{"$f":"IF('Systems Request'!P41<>\"\",'Systems Request'!$U$41,\"\")","v":""},{"$f":"IF('Systems Request'!P41<>\"\",'Systems Request'!$R$10,\"\")","v":""},{"$f":"IF('Systems Request'!P41<>\"\",\"Assign Mainframe ID\",\"\")","v":""}]
[{"$f":"IF('Systems Request'!J42=\"X\",\"X\",\"\")","v":""},{"$f":"IF('Systems Request'!K42=\"X\",\"X\",\"\")","v":""},{"$f":"IF('Systems Request'!L42=\"X\",\"X\",\"\")","v":""},{"$f":"IF('Systems Request'!M42=\"X\",\"X\",\"\")","v":""},{"$f":"IF('Systems Request'!N42=\"X\",\"X\",\"\")","v":""},{"$f":"IF('Systems Request'!O42=\"X\",\"X\",\"\")","v":""},{"$f":"IF('Systems Request'!P42=\"X\",\"X\",\"\")","v":""},{"$f":"IF('Systems Request'!Q42=\"X\",\"X\",\"\")","v":""},{"$f":"IF('Systems Request'!R42=\"X\",\"X\",\"\")","v":""},{"$f":"IF('Systems Request'!S42=\"X\",\"X\",\"\")","v":""},{"$f":"IF('Systems Request'!T42=\"X\",\"X\",\"\")","v":""},{"$f":"IF('Systems Request'!U42=\"X\",\"X\",\"\")","v":""},{"$f":"IF('Systems Request'!V42=\"X\",\"X\",\"\")","v":""},{"$f":"IF('Systems Request'!Q42<>\"\",'Systems Request'!Q42,\"\")","v":""},{"$f":"IF('Systems Request'!P42<>\"\",'Systems Request'!P42,\"\")","v":""},{"$f":"IF('Systems Request'!R42<>\"\",'Systems Request'!R42,\"\")","v":""},{"$f":"IF('Systems Request'!S42<>\"\",'Systems Request'!S42,\"\")","v":""},{"$f":"IF('Systems Request'!P42<>\"\",'Systems Request'!S$9,\"\")","v":""},{"$f":"IF('Systems Request'!P42<>\"\",'Systems Request'!$S$11,\"\")","v":""},{"$f":"IF('Systems Request'!P42<>\"\",'Systems Request'!$H$9,\"\")","v":""},{"$f":"IF('Systems Request'!P42<>\"\",'Systems Request'!$H$10,\"\")","v":""},{"$f":"IF('Systems Request'!P42<>\"\",'Systems Request'!$H$11,\"\")","v":""},{"$f":"IF('Systems Request'!P42<>\"\",'Systems Request'!$H$12,\"\")","v":""},{"$f":"IF('Systems Request'!P42<>\"\",'Systems Request'!$H$13,\"\")","v":""},{"$f":"IF('Systems Request'!P42<>\"\",'Systems Request'!$H$14,\"\")","v":""},{"$f":"IF('Systems Request'!P42<>\"\",'Systems Request'!$T$42,\"\")","v":""},{"$f":"IF('Systems Request'!P42<>\"\",'Systems Request'!$U$42,\"\")","v":""},{"$f":"IF('Systems Request'!P42<>\"\",'Systems Request'!$R$10,\"\")","v":""},{"$f":"IF('Systems Request'!P42<>\"\",\"Assign Mainframe ID\",\"\")","v":""}]
[{"$f":"IF('Systems Request'!J43=\"X\",\"X\",\"\")","v":""},{"$f":"IF('Systems Request'!K43=\"X\",\"X\",\"\")","v":""},{"$f":"IF('Systems Request'!L43=\"X\",\"X\",\"\")","v":""},{"$f":"IF('Systems Request'!M43=\"X\",\"X\",\"\")","v":""},{"$f":"IF('Systems Request'!N43=\"X\",\"X\",\"\")","v":""},{"$f":"IF('Systems Request'!O43=\"X\",\"X\",\"\")","v":""},{"$f":"IF('Systems Request'!P43=\"X\",\"X\",\"\")","v":""},{"$f":"IF('Systems Request'!Q43=\"X\",\"X\",\"\")","v":""},{"$f":"IF('Systems Request'!R43=\"X\",\"X\",\"\")","v":""},{"$f":"IF('Systems Request'!S43=\"X\",\"X\",\"\")","v":""},{"$f":"IF('Systems Request'!T43=\"X\",\"X\",\"\")","v":""},{"$f":"IF('Systems Request'!U43=\"X\",\"X\",\"\")","v":""},{"$f":"IF('Systems Request'!V43=\"X\",\"X\",\"\")","v":""},{"$f":"IF('Systems Request'!Q43<>\"\",'Systems Request'!Q43,\"\")","v":""},{"$f":"IF('Systems Request'!P43<>\"\",'Systems Request'!P43,\"\")","v":""},{"$f":"IF('Systems Request'!R43<>\"\",'Systems Request'!R43,\"\")","v":""},{"$f":"IF('Systems Request'!S43<>\"\",'Systems Request'!S43,\"\")","v":""},{"$f":"IF('Systems Request'!P43<>\"\",'Systems Request'!S$9,\"\")","v":""},{"$f":"IF('Systems Request'!P43<>\"\",'Systems Request'!$S$11,\"\")","v":""},{"$f":"IF('Systems Request'!P43<>\"\",'Systems Request'!$H$9,\"\")","v":""},{"$f":"IF('Systems Request'!P43<>\"\",'Systems Request'!$H$10,\"\")","v":""},{"$f":"IF('Systems Request'!P43<>\"\",'Systems Request'!$H$11,\"\")","v":""},{"$f":"IF('Systems Request'!P43<>\"\",'Systems Request'!$H$12,\"\")","v":""},{"$f":"IF('Systems Request'!P43<>\"\",'Systems Request'!$H$13,\"\")","v":""},{"$f":"IF('Systems Request'!P43<>\"\",'Systems Request'!$H$14,\"\")","v":""},{"$f":"IF('Systems Request'!P43<>\"\",'Systems Request'!$T$43,\"\")","v":""},{"$f":"IF('Systems Request'!P43<>\"\",'Systems Request'!$U$43,\"\")","v":""},{"$f":"IF('Systems Request'!P43<>\"\",'Systems Request'!$R$10,\"\")","v":""},{"$f":"IF('Systems Request'!P43<>\"\",\"Assign Mainframe ID\",\"\")","v":""}]
[{"$f":"IF('Systems Request'!J44=\"X\",\"X\",\"\")","v":""},{"$f":"IF('Systems Request'!K44=\"X\",\"X\",\"\")","v":""},{"$f":"IF('Systems Request'!L44=\"X\",\"X\",\"\")","v":""},{"$f":"IF('Systems Request'!M44=\"X\",\"X\",\"\")","v":""},{"$f":"IF('Systems Request'!N44=\"X\",\"X\",\"\")","v":""},{"$f":"IF('Systems Request'!O44=\"X\",\"X\",\"\")","v":""},{"$f":"IF('Systems Request'!P44=\"X\",\"X\",\"\")","v":""},{"$f":"IF('Systems Request'!Q44=\"X\",\"X\",\"\")","v":""},{"$f":"IF('Systems Request'!R44=\"X\",\"X\",\"\")","v":""},{"$f":"IF('Systems Request'!S44=\"X\",\"X\",\"\")","v":""},{"$f":"IF('Systems Request'!T44=\"X\",\"X\",\"\")","v":""},{"$f":"IF('Systems Request'!U44=\"X\",\"X\",\"\")","v":""},{"$f":"IF('Systems Request'!V44=\"X\",\"X\",\"\")","v":""},{"$f":"IF('Systems Request'!Q44<>\"\",'Systems Request'!Q44,\"\")","v":""},{"$f":"IF('Systems Request'!P44<>\"\",'Systems Request'!P44,\"\")","v":""},{"$f":"IF('Systems Request'!R44<>\"\",'Systems Request'!R44,\"\")","v":""},{"$f":"IF('Systems Request'!S44<>\"\",'Systems Request'!S44,\"\")","v":""},{"$f":"IF('Systems Request'!P44<>\"\",'Systems Request'!S$9,\"\")","v":""},{"$f":"IF('Systems Request'!P44<>\"\",'Systems Request'!$S$11,\"\")","v":""},{"$f":"IF('Systems Request'!P44<>\"\",'Systems Request'!$H$9,\"\")","v":""},{"$f":"IF('Systems Request'!P44<>\"\",'Systems Request'!$H$10,\"\")","v":""},{"$f":"IF('Systems Request'!P44<>\"\",'Systems Request'!$H$11,\"\")","v":""},{"$f":"IF('Systems Request'!P44<>\"\",'Systems Request'!$H$12,\"\")","v":""},{"$f":"IF('Systems Request'!P44<>\"\",'Systems Request'!$H$13,\"\")","v":""},{"$f":"IF('Systems Request'!P44<>\"\",'Systems Request'!$H$14,\"\")","v":""},{"$f":"IF('Systems Request'!P44<>\"\",'Systems Request'!$T$44,\"\")","v":""},{"$f":"IF('Systems Request'!P44<>\"\",'Systems Request'!$U$44,\"\")","v":""},{"$f":"IF('Systems Request'!P44<>\"\",'Systems Request'!$R$10,\"\")","v":""},{"$f":"IF('Systems Request'!P44<>\"\",\"Assign Mainframe ID\",\"\")","v":""}]
[{"$f":"IF('Systems Request'!J45=\"X\",\"X\",\"\")","v":""},{"$f":"IF('Systems Request'!K45=\"X\",\"X\",\"\")","v":""},{"$f":"IF('Systems Request'!L45=\"X\",\"X\",\"\")","v":""},{"$f":"IF('Systems Request'!M45=\"X\",\"X\",\"\")","v":""},{"$f":"IF('Systems Request'!N45=\"X\",\"X\",\"\")","v":""},{"$f":"IF('Systems Request'!O45=\"X\",\"X\",\"\")","v":""},{"$f":"IF('Systems Request'!P45=\"X\",\"X\",\"\")","v":""},{"$f":"IF('Systems Request'!Q45=\"X\",\"X\",\"\")","v":""},{"$f":"IF('Systems Request'!R45=\"X\",\"X\",\"\")","v":""},{"$f":"IF('Systems Request'!S45=\"X\",\"X\",\"\")","v":""},{"$f":"IF('Systems Request'!T45=\"X\",\"X\",\"\")","v":""},{"$f":"IF('Systems Request'!U45=\"X\",\"X\",\"\")","v":""},{"$f":"IF('Systems Request'!V45=\"X\",\"X\",\"\")","v":""},{"$f":"IF('Systems Request'!Q45<>\"\",'Systems Request'!Q45,\"\")","v":""},{"$f":"IF('Systems Request'!P45<>\"\",'Systems Request'!P45,\"\")","v":""},{"$f":"IF('Systems Request'!R45<>\"\",'Systems Request'!R45,\"\")","v":""},{"$f":"IF('Systems Request'!S45<>\"\",'Systems Request'!S45,\"\")","v":""},{"$f":"IF('Systems Request'!P45<>\"\",'Systems Request'!S$9,\"\")","v":""},{"$f":"IF('Systems Request'!P45<>\"\",'Systems Request'!$S$11,\"\")","v":""},{"$f":"IF('Systems Request'!P45<>\"\",'Systems Request'!$H$9,\"\")","v":""},{"$f":"IF('Systems Request'!P45<>\"\",'Systems Request'!$H$10,\"\")","v":""},{"$f":"IF('Systems Request'!P45<>\"\",'Systems Request'!$H$11,\"\")","v":""},{"$f":"IF('Systems Request'!P45<>\"\",'Systems Request'!$H$12,\"\")","v":""},{"$f":"IF('Systems Request'!P45<>\"\",'Systems Request'!$H$13,\"\")","v":""},{"$f":"IF('Systems Request'!P45<>\"\",'Systems Request'!$H$14,\"\")","v":""},{"$f":"IF('Systems Request'!P45<>\"\",'Systems Request'!$T$45,\"\")","v":""},{"$f":"IF('Systems Request'!P45<>\"\",'Systems Request'!$U$45,\"\")","v":""},{"$f":"IF('Systems Request'!P45<>\"\",'Systems Request'!$R$10,\"\")","v":""},{"$f":"IF('Systems Request'!P45<>\"\",\"Assign Mainframe ID\",\"\")","v":""}]
[{"$f":"IF('Systems Request'!J46=\"X\",\"X\",\"\")","v":""},{"$f":"IF('Systems Request'!K46=\"X\",\"X\",\"\")","v":""},{"$f":"IF('Systems Request'!L46=\"X\",\"X\",\"\")","v":""},{"$f":"IF('Systems Request'!M46=\"X\",\"X\",\"\")","v":""},{"$f":"IF('Systems Request'!N46=\"X\",\"X\",\"\")","v":""},{"$f":"IF('Systems Request'!O46=\"X\",\"X\",\"\")","v":""},{"$f":"IF('Systems Request'!P46=\"X\",\"X\",\"\")","v":""},{"$f":"IF('Systems Request'!Q46=\"X\",\"X\",\"\")","v":""},{"$f":"IF('Systems Request'!R46=\"X\",\"X\",\"\")","v":""},{"$f":"IF('Systems Request'!S46=\"X\",\"X\",\"\")","v":""},{"$f":"IF('Systems Request'!T46=\"X\",\"X\",\"\")","v":""},{"$f":"IF('Systems Request'!U46=\"X\",\"X\",\"\")","v":""},{"$f":"IF('Systems Request'!V46=\"X\",\"X\",\"\")","v":""},{"$f":"IF('Systems Request'!Q46<>\"\",'Systems Request'!Q46,\"\")","v":""},{"$f":"IF('Systems Request'!P46<>\"\",'Systems Request'!P46,\"\")","v":""},{"$f":"IF('Systems Request'!R46<>\"\",'Systems Request'!R46,\"\")","v":""},{"$f":"IF('Systems Request'!S46<>\"\",'Systems Request'!S46,\"\")","v":""},{"$f":"IF('Systems Request'!P46<>\"\",'Systems Request'!S$9,\"\")","v":""},{"$f":"IF('Systems Request'!P46<>\"\",'Systems Request'!$S$11,\"\")","v":""},{"$f":"IF('Systems Request'!P46<>\"\",'Systems Request'!$H$9,\"\")","v":""},{"$f":"IF('Systems Request'!P46<>\"\",'Systems Request'!$H$10,\"\")","v":""},{"$f":"IF('Systems Request'!P46<>\"\",'Systems Request'!$H$11,\"\")","v":""},{"$f":"IF('Systems Request'!P46<>\"\",'Systems Request'!$H$12,\"\")","v":""},{"$f":"IF('Systems Request'!P46<>\"\",'Systems Request'!$H$13,\"\")","v":""},{"$f":"IF('Systems Request'!P46<>\"\",'Systems Request'!$H$14,\"\")","v":""},{"$f":"IF('Systems Request'!P46<>\"\",'Systems Request'!$T$46,\"\")","v":""},{"$f":"IF('Systems Request'!P46<>\"\",'Systems Request'!$U$46,\"\")","v":""},{"$f":"IF('Systems Request'!P46<>\"\",'Systems Request'!$R$10,\"\")","v":""},{"$f":"IF('Systems Request'!P46<>\"\",\"Assign Mainframe ID\",\"\")","v":""}]
[{"$f":"IF('Systems Request'!J47=\"X\",\"X\",\"\")","v":""},{"$f":"IF('Systems Request'!K47=\"X\",\"X\",\"\")","v":""},{"$f":"IF('Systems Request'!L47=\"X\",\"X\",\"\")","v":""},{"$f":"IF('Systems Request'!M47=\"X\",\"X\",\"\")","v":""},{"$f":"IF('Systems Request'!N47=\"X\",\"X\",\"\")","v":""},{"$f":"IF('Systems Request'!O47=\"X\",\"X\",\"\")","v":""},{"$f":"IF('Systems Request'!P47=\"X\",\"X\",\"\")","v":""},{"$f":"IF('Systems Request'!Q47=\"X\",\"X\",\"\")","v":""},{"$f":"IF('Systems Request'!R47=\"X\",\"X\",\"\")","v":""},{"$f":"IF('Systems Request'!S47=\"X\",\"X\",\"\")","v":""},{"$f":"IF('Systems Request'!T47=\"X\",\"X\",\"\")","v":""},{"$f":"IF('Systems Request'!U47=\"X\",\"X\",\"\")","v":""},{"$f":"IF('Systems Request'!V47=\"X\",\"X\",\"\")","v":""},{"$f":"IF('Systems Request'!Q47<>\"\",'Systems Request'!Q47,\"\")","v":""},{"$f":"IF('Systems Request'!P47<>\"\",'Systems Request'!P47,\"\")","v":""},{"$f":"IF('Systems Request'!R47<>\"\",'Systems Request'!R47,\"\")","v":""},{"$f":"IF('Systems Request'!S47<>\"\",'Systems Request'!S47,\"\")","v":""},{"$f":"IF('Systems Request'!P47<>\"\",'Systems Request'!S$9,\"\")","v":""},{"$f":"IF('Systems Request'!P47<>\"\",'Systems Request'!$S$11,\"\")","v":""},{"$f":"IF('Systems Request'!P47<>\"\",'Systems Request'!$H$9,\"\")","v":""},{"$f":"IF('Systems Request'!P47<>\"\",'Systems Request'!$H$10,\"\")","v":""},{"$f":"IF('Systems Request'!P47<>\"\",'Systems Request'!$H$11,\"\")","v":""},{"$f":"IF('Systems Request'!P47<>\"\",'Systems Request'!$H$12,\"\")","v":""},{"$f":"IF('Systems Request'!P47<>\"\",'Systems Request'!$H$13,\"\")","v":""},{"$f":"IF('Systems Request'!P47<>\"\",'Systems Request'!$H$14,\"\")","v":""},{"$f":"IF('Systems Request'!P47<>\"\",'Systems Request'!$T$47,\"\")","v":""},{"$f":"IF('Systems Request'!P47<>\"\",'Systems Request'!$U$47,\"\")","v":""},{"$f":"IF('Systems Request'!P47<>\"\",'Systems Request'!$R$10,\"\")","v":""},{"$f":"IF('Systems Request'!P47<>\"\",\"Assign Mainframe ID\",\"\")","v":""}]
[{"$f":"IF('Systems Request'!J48=\"X\",\"X\",\"\")","v":""},{"$f":"IF('Systems Request'!K48=\"X\",\"X\",\"\")","v":""},{"$f":"IF('Systems Request'!L48=\"X\",\"X\",\"\")","v":""},{"$f":"IF('Systems Request'!M48=\"X\",\"X\",\"\")","v":""},{"$f":"IF('Systems Request'!N48=\"X\",\"X\",\"\")","v":""},{"$f":"IF('Systems Request'!O48=\"X\",\"X\",\"\")","v":""},{"$f":"IF('Systems Request'!P48=\"X\",\"X\",\"\")","v":""},{"$f":"IF('Systems Request'!Q48=\"X\",\"X\",\"\")","v":""},{"$f":"IF('Systems Request'!R48=\"X\",\"X\",\"\")","v":""},{"$f":"IF('Systems Request'!S48=\"X\",\"X\",\"\")","v":""},{"$f":"IF('Systems Request'!T48=\"X\",\"X\",\"\")","v":""},{"$f":"IF('Systems Request'!U48=\"X\",\"X\",\"\")","v":""},{"$f":"IF('Systems Request'!V48=\"X\",\"X\",\"\")","v":""},{"$f":"IF('Systems Request'!Q48<>\"\",'Systems Request'!Q48,\"\")","v":""},{"$f":"IF('Systems Request'!P48<>\"\",'Systems Request'!P48,\"\")","v":""},{"$f":"IF('Systems Request'!R48<>\"\",'Systems Request'!R48,\"\")","v":""},{"$f":"IF('Systems Request'!S48<>\"\",'Systems Request'!S48,\"\")","v":""},{"$f":"IF('Systems Request'!P48<>\"\",'Systems Request'!S$9,\"\")","v":""},{"$f":"IF('Systems Request'!P48<>\"\",'Systems Request'!$S$11,\"\")","v":""},{"$f":"IF('Systems Request'!P48<>\"\",'Systems Request'!$H$9,\"\")","v":""},{"$f":"IF('Systems Request'!P48<>\"\",'Systems Request'!$H$10,\"\")","v":""},{"$f":"IF('Systems Request'!P48<>\"\",'Systems Request'!$H$11,\"\")","v":""},{"$f":"IF('Systems Request'!P48<>\"\",'Systems Request'!$H$12,\"\")","v":""},{"$f":"IF('Systems Request'!P48<>\"\",'Systems Request'!$H$13,\"\")","v":""},{"$f":"IF('Systems Request'!P48<>\"\",'Systems Request'!$H$14,\"\")","v":""},{"$f":"IF('Systems Request'!P48<>\"\",'Systems Request'!$T$48,\"\")","v":""},{"$f":"IF('Systems Request'!P48<>\"\",'Systems Request'!$U$48,\"\")","v":""},{"$f":"IF('Systems Request'!P48<>\"\",'Systems Request'!$R$10,\"\")","v":""},{"$f":"IF('Systems Request'!P48<>\"\",\"Assign Mainframe ID\",\"\")","v":""}]
[{"$f":"IF('Systems Request'!J49=\"X\",\"X\",\"\")","v":""},{"$f":"IF('Systems Request'!K49=\"X\",\"X\",\"\")","v":""},{"$f":"IF('Systems Request'!L49=\"X\",\"X\",\"\")","v":""},{"$f":"IF('Systems Request'!M49=\"X\",\"X\",\"\")","v":""},{"$f":"IF('Systems Request'!N49=\"X\",\"X\",\"\")","v":""},{"$f":"IF('Systems Request'!O49=\"X\",\"X\",\"\")","v":""},{"$f":"IF('Systems Request'!P49=\"X\",\"X\",\"\")","v":""},{"$f":"IF('Systems Request'!Q49=\"X\",\"X\",\"\")","v":""},{"$f":"IF('Systems Request'!R49=\"X\",\"X\",\"\")","v":""},{"$f":"IF('Systems Request'!S49=\"X\",\"X\",\"\")","v":""},{"$f":"IF('Systems Request'!T49=\"X\",\"X\",\"\")","v":""},{"$f":"IF('Systems Request'!U49=\"X\",\"X\",\"\")","v":""},{"$f":"IF('Systems Request'!V49=\"X\",\"X\",\"\")","v":""},{"$f":"IF('Systems Request'!Q49<>\"\",'Systems Request'!Q49,\"\")","v":""},{"$f":"IF('Systems Request'!P49<>\"\",'Systems Request'!P49,\"\")","v":""},{"$f":"IF('Systems Request'!R49<>\"\",'Systems Request'!R49,\"\")","v":""},{"$f":"IF('Systems Request'!S49<>\"\",'Systems Request'!S49,\"\")","v":""},{"$f":"IF('Systems Request'!P49<>\"\",'Systems Request'!S$9,\"\")","v":""},{"$f":"IF('Systems Request'!P49<>\"\",'Systems Request'!$S$11,\"\")","v":""},{"$f":"IF('Systems Request'!P49<>\"\",'Systems Request'!$H$9,\"\")","v":""},{"$f":"IF('Systems Request'!P49<>\"\",'Systems Request'!$H$10,\"\")","v":""},{"$f":"IF('Systems Request'!P49<>\"\",'Systems Request'!$H$11,\"\")","v":""},{"$f":"IF('Systems Request'!P49<>\"\",'Systems Request'!$H$12,\"\")","v":""},{"$f":"IF('Systems Request'!P49<>\"\",'Systems Request'!$H$13,\"\")","v":""},{"$f":"IF('Systems Request'!P49<>\"\",'Systems Request'!$H$14,\"\")","v":""},{"$f":"IF('Systems Request'!P49<>\"\",'Systems Request'!$T$49,\"\")","v":""},{"$f":"IF('Systems Request'!P49<>\"\",'Systems Request'!$U$49,\"\")","v":""},{"$f":"IF('Systems Request'!P49<>\"\",'Systems Request'!$R$10,\"\")","v":""},{"$f":"IF('Systems Request'!P49<>\"\",\"Assign Mainframe ID\",\"\")","v":""}]

{"sheet":"Coverall 1","index":3,"n_rows":27,"n_cols":9,"rows_kept":27,"cut":false,"hidden":true,"merged":[[26,2,26,4],[26,6,26,8],[20,2,21,8],[22,2,22,8],[23,2,23,4],[23,6,23,8],[25,2,25,4],[25,6,25,8],[24,2,24,4],[24,6,24,8],[17,2,17,4],[17,6,17,8],[18,2,18,4],[18,6,18,8],[19,2,19,4],[14,2,14,4],[14,6,14,8],[15,2,15,4],[15,6,15,8],[16,2,16,4],[16,6,16,8],[13,2,13,4],[13,6,13,8],[7,2,7,4],[4,6,4,8],[5,6,5,8],[6,6,6,8],[7,6,7,8],[8,2,9,8],[6,2,6,4],[10,2,10,8],[11,2,11,4],[11,6,11,8],[12,2,12,4],[12,6,12,8],[2,2,2,8],[3,2,3,4],[3,6,3,8],[4,2,4,4],[5,2,5,4]]}
[]
[]
[null,null,"Lexington MPS/CVL NG User Request Form"]
[null,null,"Request Type",null,null,null,"Add User"]
[null,null,"Request Date",null,null,null,{"$f":"'Systems Request'!$S$12","v":"00:00:00"}]
[null,null,"Request By (Must be user's manager)",null,null,null,{"$f":"'MPS_CVL NG'!$D$6","v":0}]
[null,null,"Classic, NexGen or Both",null,null,null,{"$f":"'MPS_CVL NG'!$G$6","v":0}]
[null,null,"User Requires Access to Production, Model or Both",null,null,null,{"$f":"'MPS_CVL NG'!$H$6","v":""}]
[]
[]
[null,null,"Addl User Request"]
[null,null,"Full User Name",null,null,null,{"$f":"'MPS_CVL NG'!$A$6","v":""}]
[null,null,"User Email List",null,null,null,{"$f":"IF(G12<>\"\",'Systems Request'!$V$25,\"\")","v":""}]
[null,null,"Role (see Page 2 of form for descriptions)",null,null,null,{"$f":"'MPS_CVL NG'!$B$6","v":""}]
[null,null,"Internal User",null,null,null,"No"]
[null,null,"Business Justification for Access Requested:",null,null,null,{"$f":"'MPS_CVL NG'!$I$6","v":0}]
[null,null,"Grant Access to \"Producer Number(s)\" List all Needed",null,null,null,{"$f":"'MPS_CVL NG'!$J$6&\" \" & 'MPS_CVL NG'!$K$6","v":" "}]
[null,null,"Underwriter ID Needed (See Role Requirements):",null,null,null,{"$f":"IF('MPS_CVL NG'!$C$6=\"Yes\",\"Yes\",IF('MPS_CVL NG'!$B$6=\"PA Manager\",\"Yes\",IF('MPS_CVL NG'!$B$6=\"Underwriter PA\",\"Yes\",\"No\")))","v":"No"}]
[null,null,"Underwriter Access to \"Producer Number(s)\" only needed if Under ID requested):",null,null,null,{"$f":"IF(G18=\"Yes\",$G$17,\"\")","v":""}]
[null,null,"If View Only User - Name Source",null,null,null,{"$f":"IF('MPS_CVL NG'!$E$6=\"View Only\",'MPS_CVL NG'!$F$6,\"\")","v":""},"If Other",{"$f":"IF('MPS_CVL NG'!$F$6=\"Other\",'MPS_CVL NG'!$G$6,\"\")","v":""}]
[]
[]
[null,null,"Delete / Change User Request"]
[null,null,"Full User Name"]
[null,null,"Describe Change"]
[null,null,"Business Justification for Change Requested:"]
[null,null,"Effective Date of Change"]

{"sheet":"Coverall 2","index":4,"n_rows":27,"n_cols":9,"rows_kept":27,"cut":false,"hidden":true,"merged":[[26,2,26,4],[26,6,26,8],[22,2,22,8],[23,2,23,4],[23,6,23,8],[24,2,24,4],[24,6,24,8],[25,2,25,4],[25,6,25,8],[20,2,21,8],[14,2,14,4],[14,6,14,8],[15,2,15,4],[15,6,15,8],[16,2,16,4],[16,6,16,8],[17,2,17,4],[17,6,17,8],[18,2,18,4],[18,6,18,8],[19,2,19,4],[11,2,11,4],[11,6,11,8],[12,2,12,4],[12,6,12,8],[13,2,13,4],[13,6,13,8],[10,2,10,8],[2,2,2,8],[3,2,3,4],[3,6,3,8],[4,2,4,4],[4,6,4,8],[5,2,5,4],[5,6,5,8],[6,2,6,4],[6,6,6,8],[7,2,7,4],[7,6,7,8],[8,2,9,8]]}
[]
[]
[null,null,"Lexington MPS/CVL NG User Request Form"]
[null,null,"Request Type",null,null,null,"Add User"]
[null,null,"Request Date",null,null,null,{"$f":"'Systems Request'!$S$12","v":"00:00:00"}]
[null,null,"Request By (Must be user's manager)",null,null,null,{"$f":"'MPS_CVL NG'!$D$7","v":0}]
[null,null,"Classic, NexGen or Both",null,null,null,{"$f":"'MPS_CVL NG'!$G$7","v":""}]
[null,null,"User Requires Access to Production, Model or Both",null,null,null,{"$f":"'MPS_CVL NG'!$H$7","v":""}]
[]
[]
[null,null,"Addl User Request"]
[null,null,"Full User Name",null,null,null,{"$f":"'MPS_CVL NG'!$A$7","v":""}]
[null,null,"User Email List",null,null,null,{"$f":"IF(G12<>\"\",'Systems Request'!$V$26,\"\")","v":""}]
[null,null,"Role (see Page 2 of form for descriptions)",null,null,null,{"$f":"'MPS_CVL NG'!$B$7","v":""}]
[null,null,"Internal User",null,null,null,"No"]
[null,null,"Business Justification for Access Requested:",null,null,null,{"$f":"'MPS_CVL NG'!$I$7","v":0}]
[null,null,"Grant Access to \"Producer Number(s)\" List all Needed",null,null,null,{"$f":"'MPS_CVL NG'!$J$7&\" \" & 'MPS_CVL NG'!$K$7","v":" "}]
[null,null,"Underwriter ID Needed (See Role Requirements):",null,null,null,{"$f":"IF('MPS_CVL NG'!$C$7=\"Yes\",\"Yes\",IF('MPS_CVL NG'!$B$7=\"PA Manager\",\"Yes\",IF('MPS_CVL NG'!$B$7=\"Underwriter PA\",\"Yes\",\"No\")))","v":"No"}]
[null,null,"Underwriter Access to \"Producer Number(s)\" only needed if Under ID requested):",null,null,null,{"$f":"IF(G18=\"Yes\",$G$17,\"\")","v":""}]
[null,null,"If View Only User - Name Source",null,null,null,{"$f":"IF('MPS_CVL NG'!$E$7=\"View Only\",'MPS_CVL NG'!$F$7,\"\")","v":""},"If Other",{"$f":"IF('MPS_CVL NG'!$F$7=\"Other\",'MPS_CVL NG'!$G$7,\"\")","v":""}]
[]
[]
[null,null,"Delete / Change User Request"]
[null,null,"Full User Name"]
[null,null,"Describe Change"]
[null,null,"Business Justification for Change Requested:"]
[null,null,"Effective Date of Change"]

{"sheet":"Coverall 3","index":5,"n_rows":27,"n_cols":9,"rows_kept":27,"cut":false,"hidden":true,"merged":[[26,2,26,4],[26,6,26,8],[22,2,22,8],[23,2,23,4],[23,6,23,8],[24,2,24,4],[24,6,24,8],[25,2,25,4],[25,6,25,8],[20,2,21,8],[14,2,14,4],[14,6,14,8],[15,2,15,4],[15,6,15,8],[16,2,16,4],[16,6,16,8],[17,2,17,4],[17,6,17,8],[18,2,18,4],[18,6,18,8],[19,2,19,4],[11,2,11,4],[11,6,11,8],[12,2,12,4],[12,6,12,8],[13,2,13,4],[13,6,13,8],[10,2,10,8],[2,2,2,8],[3,2,3,4],[3,6,3,8],[4,2,4,4],[4,6,4,8],[5,2,5,4],[5,6,5,8],[6,2,6,4],[6,6,6,8],[7,2,7,4],[7,6,7,8],[8,2,9,8]]}
[]
[]
[null,null,"Lexington MPS/CVL NG User Request Form"]
[null,null,"Request Type",null,null,null,"Add User"]
[null,null,"Request Date",null,null,null,{"$f":"'Systems Request'!$S$12","v":"00:00:00"}]
[null,null,"Request By (Must be user's manager)",null,null,null,{"$f":"'MPS_CVL NG'!$D$8","v":0}]
[null,null,"Classic, NexGen or Both",null,null,null,{"$f":"'MPS_CVL NG'!$G$8","v":""}]
[null,null,"User Requires Access to Production, Model or Both",null,null,null,{"$f":"'MPS_CVL NG'!$H$8","v":""}]
[]
[]
[null,null,"Addl User Request"]
[null,null,"Full User Name",null,null,null,{"$f":"'MPS_CVL NG'!$A$8","v":""}]
[null,null,"User Email List",null,null,null,{"$f":"IF(G12<>\"\",'Systems Request'!$V$27,\"\")","v":""}]
[null,null,"Role (see Page 2 of form for descriptions)",null,null,null,{"$f":"'MPS_CVL NG'!$B$8","v":""}]
[null,null,"Internal User",null,null,null,"No"]
[null,null,"Business Justification for Access Requested:",null,null,null,{"$f":"'MPS_CVL NG'!$I$8","v":""}]
[null,null,"Grant Access to \"Producer Number(s)\" List all Needed",null,null,null,{"$f":"'MPS_CVL NG'!$J$8&\" \" & 'MPS_CVL NG'!$K$8","v":" "}]
[null,null,"Underwriter ID Needed (See Role Requirements):",null,null,null,{"$f":"IF('MPS_CVL NG'!$C$8=\"Yes\",\"Yes\",IF('MPS_CVL NG'!$B$8=\"PA Manager\",\"Yes\",IF('MPS_CVL NG'!$B$8=\"Underwriter PA\",\"Yes\",\"No\")))","v":"No"}]
[null,null,"Underwriter Access to \"Producer Number(s)\" only needed if Under ID requested):",null,null,null,{"$f":"IF(G18=\"Yes\",$G$17,\"\")","v":""}]
[null,null,"If View Only User - Name Source",null,null,null,{"$f":"IF('MPS_CVL NG'!$E$8=\"View Only\",'MPS_CVL NG'!$F$8,\"\")","v":""},"If Other",{"$f":"IF('MPS_CVL NG'!$F$8=\"Other\",'MPS_CVL NG'!$G$8,\"\")","v":""}]
[]
[]
[null,null,"Delete / Change User Request"]
[null,null,"Full User Name"]
[null,null,"Describe Change"]
[null,null,"Business Justification for Change Requested:"]
[null,null,"Effective Date of Change"]

{"sheet":"Coverall 4","index":6,"n_rows":27,"n_cols":9,"rows_kept":27,"cut":false,"hidden":true,"merged":[[26,2,26,4],[26,6,26,8],[22,2,22,8],[23,2,23,4],[23,6,23,8],[24,2,24,4],[24,6,24,8],[25,2,25,4],[25,6,25,8],[20,2,21,8],[14,2,14,4],[14,6,14,8],[15,2,15,4],[15,6,15,8],[16,2,16,4],[16,6,16,8],[17,2,17,4],[17,6,17,8],[18,2,18,4],[18,6,18,8],[19,2,19,4],[11,2,11,4],[11,6,11,8],[12,2,12,4],[12,6,12,8],[13,2,13,4],[13,6,13,8],[10,2,10,8],[2,2,2,8],[3,2,3,4],[3,6,3,8],[4,2,4,4],[4,6,4,8],[5,2,5,4],[5,6,5,8],[6,2,6,4],[6,6,6,8],[7,2,7,4],[7,6,7,8],[8,2,9,8]]}
[]
[]
[null,null,"Lexington MPS/CVL NG User Request Form"]
[null,null,"Request Type",null,null,null,"Add User"]
[null,null,"Request Date",null,null,null,{"$f":"'Systems Request'!$S$12","v":"00:00:00"}]
[null,null,"Request By (Must be user's manager)",null,null,null,{"$f":"'MPS_CVL NG'!$D$9","v":0}]
[null,null,"Classic, NexGen or Both",null,null,null,{"$f":"'MPS_CVL NG'!$G$9","v":""}]
[null,null,"User Requires Access to Production, Model or Both",null,null,null,{"$f":"'MPS_CVL NG'!$H$9","v":""}]
[]
[]
[null,null,"Addl User Request"]
[null,null,"Full User Name",null,null,null,{"$f":"'MPS_CVL NG'!$A$9","v":""}]
[null,null,"User Email List",null,null,null,{"$f":"IF(G12<>\"\",'Systems Request'!$V$28,\"\")","v":""}]
[null,null,"Role (see Page 2 of form for descriptions)",null,null,null,{"$f":"'MPS_CVL NG'!$B$9","v":""}]
[null,null,"Internal User",null,null,null,"No"]
[null,null,"Business Justification for Access Requested:",null,null,null,{"$f":"'MPS_CVL NG'!$I$98","v":0}]
[null,null,"Grant Access to \"Producer Number(s)\" List all Needed",null,null,null,{"$f":"'MPS_CVL NG'!$J$9&\" \" & 'MPS_CVL NG'!$K$9","v":" "}]
[null,null,"Underwriter ID Needed (See Role Requirements):",null,null,null,{"$f":"IF('MPS_CVL NG'!$C$9=\"Yes\",\"Yes\",IF('MPS_CVL NG'!$B$9=\"PA Manager\",\"Yes\",IF('MPS_CVL NG'!$B$9=\"Underwriter PA\",\"Yes\",\"No\")))","v":"No"}]
[null,null,"Underwriter Access to \"Producer Number(s)\" only needed if Under ID requested):",null,null,null,{"$f":"IF(G18=\"Yes\",$G$17,\"\")","v":""}]
[null,null,"If View Only User - Name Source",null,null,null,{"$f":"IF('MPS_CVL NG'!$E$9=\"View Only\",'MPS_CVL NG'!$F$9,\"\")","v":""},"If Other",{"$f":"IF('MPS_CVL NG'!$F$9=\"Other\",'MPS_CVL NG'!$G$9,\"\")","v":""}]
[]
[]
[null,null,"Delete / Change User Request"]
[null,null,"Full User Name"]
[null,null,"Describe Change"]
[null,null,"Business Justification for Change Requested:"]
[null,null,"Effective Date of Change"]

{"sheet":"Coverall 5","index":7,"n_rows":27,"n_cols":9,"rows_kept":27,"cut":false,"hidden":true,"merged":[[26,2,26,4],[26,6,26,8],[22,2,22,8],[23,2,23,4],[23,6,23,8],[24,2,24,4],[24,6,24,8],[25,2,25,4],[25,6,25,8],[20,2,21,8],[14,2,14,4],[14,6,14,8],[15,2,15,4],[15,6,15,8],[16,2,16,4],[16,6,16,8],[17,2,17,4],[17,6,17,8],[18,2,18,4],[18,6,18,8],[19,2,19,4],[11,2,11,4],[11,6,11,8],[12,2,12,4],[12,6,12,8],[13,2,13,4],[13,6,13,8],[10,2,10,8],[2,2,2,8],[3,2,3,4],[3,6,3,8],[4,2,4,4],[4,6,4,8],[5,2,5,4],[5,6,5,8],[6,2,6,4],[6,6,6,8],[7,2,7,4],[7,6,7,8],[8,2,9,8]]}
[]
[]
[null,null,"Lexington MPS/CVL NG User Request Form"]
[null,null,"Request Type",null,null,null,"Add User"]
[null,null,"Request Date",null,null,null,{"$f":"'Systems Request'!$S$12","v":"00:00:00"}]
[null,null,"Request By (Must be user's manager)",null,null,null,{"$f":"'MPS_CVL NG'!$D$10","v":0}]
[null,null,"Classic, NexGen or Both",null,null,null,{"$f":"'MPS_CVL NG'!$G$10","v":""}]
[null,null,"User Requires Access to Production, Model or Both",null,null,null,{"$f":"'MPS_CVL NG'!$H$10","v":""}]
[]
[]
[null,null,"Addl User Request"]
[null,null,"Full User Name",null,null,null,{"$f":"'MPS_CVL NG'!$A$10","v":""}]
[null,null,"User Email List",null,null,null,{"$f":"IF(G12<>\"\",'Systems Request'!$V$29,\"\")","v":""}]
[null,null,"Role (see Page 2 of form for descriptions)",null,null,null,{"$f":"'MPS_CVL NG'!$B$10","v":""}]
[null,null,"Internal User",null,null,null,"No"]
[null,null,"Business Justification for Access Requested:",null,null,null,{"$f":"'MPS_CVL NG'!$I$10","v":""}]
[null,null,"Grant Access to \"Producer Number(s)\" List all Needed",null,null,null,{"$f":"'MPS_CVL NG'!$J$10&\" \" & 'MPS_CVL NG'!$K$10","v":" "}]
[null,null,"Underwriter ID Needed (See Role Requirements):",null,null,null,{"$f":"IF('MPS_CVL NG'!$C$10=\"Yes\",\"Yes\",IF('MPS_CVL NG'!$B$10=\"PA Manager\",\"Yes\",IF('MPS_CVL NG'!$B$10=\"Underwriter PA\",\"Yes\",\"No\")))","v":"No"}]
[null,null,"Underwriter Access to \"Producer Number(s)\" only needed if Under ID requested):",null,null,null,{"$f":"IF(G18=\"Yes\",$G$17,\"\")","v":""}]
[null,null,"If View Only User - Name Source",null,null,null,{"$f":"IF('MPS_CVL NG'!$E$10=\"View Only\",'MPS_CVL NG'!$F$10,\"\")","v":""},"If Other",{"$f":"IF('MPS_CVL NG'!$F$10=\"Other\",'MPS_CVL NG'!$G$10,\"\")","v":""}]
[]
[]
[null,null,"Delete / Change User Request"]
[null,null,"Full User Name"]
[null,null,"Describe Change"]
[null,null,"Business Justification for Change Requested:"]
[null,null,"Effective Date of Change"]

{"sheet":"Coverall 6","index":8,"n_rows":27,"n_cols":9,"rows_kept":27,"cut":false,"hidden":true,"merged":[[26,2,26,4],[26,6,26,8],[22,2,22,8],[23,2,23,4],[23,6,23,8],[24,2,24,4],[24,6,24,8],[25,2,25,4],[25,6,25,8],[20,2,21,8],[14,2,14,4],[14,6,14,8],[15,2,15,4],[15,6,15,8],[16,2,16,4],[16,6,16,8],[17,2,17,4],[17,6,17,8],[18,2,18,4],[18,6,18,8],[19,2,19,4],[11,2,11,4],[11,6,11,8],[12,2,12,4],[12,6,12,8],[13,2,13,4],[13,6,13,8],[10,2,10,8],[2,2,2,8],[3,2,3,4],[3,6,3,8],[4,2,4,4],[4,6,4,8],[5,2,5,4],[5,6,5,8],[6,2,6,4],[6,6,6,8],[7,2,7,4],[7,6,7,8],[8,2,9,8]]}
[]
[]
[null,null,"Lexington MPS/CVL NG User Request Form"]
[null,null,"Request Type",null,null,null,"Add User"]
[null,null,"Request Date",null,null,null,{"$f":"'Systems Request'!$S$12","v":"00:00:00"}]
[null,null,"Request By (Must be user's manager)",null,null,null,{"$f":"'MPS_CVL NG'!$D$11","v":0}]
[null,null,"Classic, NexGen or Both",null,null,null,{"$f":"'MPS_CVL NG'!$G$11","v":""}]
[null,null,"User Requires Access to Production, Model or Both",null,null,null,{"$f":"'MPS_CVL NG'!$H$11","v":""}]
[]
[]
[null,null,"Addl User Request"]
[null,null,"Full User Name",null,null,null,{"$f":"'MPS_CVL NG'!$A$11","v":""}]
[null,null,"User Email List",null,null,null,{"$f":"IF(G12<>\"\",'Systems Request'!$V$30,\"\")","v":""}]
[null,null,"Role (see Page 2 of form for descriptions)",null,null,null,{"$f":"'MPS_CVL NG'!$B$11","v":""}]
[null,null,"Internal User",null,null,null,"No"]
[null,null,"Business Justification for Access Requested:",null,null,null,{"$f":"'MPS_CVL NG'!$I$11","v":""}]
[null,null,"Grant Access to \"Producer Number(s)\" List all Needed",null,null,null,{"$f":"'MPS_CVL NG'!$J$6&\" \" & 'MPS_CVL NG'!$K$11","v":" "}]
[null,null,"Underwriter ID Needed (See Role Requirements):",null,null,null,{"$f":"IF('MPS_CVL NG'!$C$11=\"Yes\",\"Yes\",IF('MPS_CVL NG'!$B$11=\"PA Manager\",\"Yes\",IF('MPS_CVL NG'!$B$11=\"Underwriter PA\",\"Yes\",\"No\")))","v":"No"}]
[null,null,"Underwriter Access to \"Producer Number(s)\" only needed if Under ID requested):",null,null,null,{"$f":"IF(G18=\"Yes\",$G$17,\"\")","v":""}]
[null,null,"If View Only User - Name Source",null,null,null,{"$f":"IF('MPS_CVL NG'!$E$11=\"View Only\",'MPS_CVL NG'!$F$11,\"\")","v":""},"If Other",{"$f":"IF('MPS_CVL NG'!$F$11=\"Other\",'MPS_CVL NG'!$G$11,\"\")","v":""}]
[]
[]
[null,null,"Delete / Change User Request"]
[null,null,"Full User Name"]
[null,null,"Describe Change"]
[null,null,"Business Justification for Change Requested:"]
[null,null,"Effective Date of Change"]

{"sheet":"Coverall 7","index":9,"n_rows":27,"n_cols":9,"rows_kept":27,"cut":false,"hidden":true,"merged":[[26,2,26,4],[26,6,26,8],[22,2,22,8],[23,2,23,4],[23,6,23,8],[24,2,24,4],[24,6,24,8],[25,2,25,4],[25,6,25,8],[20,2,21,8],[14,2,14,4],[14,6,14,8],[15,2,15,4],[15,6,15,8],[16,2,16,4],[16,6,16,8],[17,2,17,4],[17,6,17,8],[18,2,18,4],[18,6,18,8],[19,2,19,4],[11,2,11,4],[11,6,11,8],[12,2,12,4],[12,6,12,8],[13,2,13,4],[13,6,13,8],[10,2,10,8],[2,2,2,8],[3,2,3,4],[3,6,3,8],[4,2,4,4],[4,6,4,8],[5,2,5,4],[5,6,5,8],[6,2,6,4],[6,6,6,8],[7,2,7,4],[7,6,7,8],[8,2,9,8]]}
[]
[]
[null,null,"Lexington MPS/CVL NG User Request Form"]
[null,null,"Request Type",null,null,null,"Add User"]
[null,null,"Request Date",null,null,null,{"$f":"'Systems Request'!$S$12","v":"00:00:00"}]
[null,null,"Request By (Must be user's manager)",null,null,null,{"$f":"'MPS_CVL NG'!$D$12","v":0}]
[null,null,"Classic, NexGen or Both",null,null,null,{"$f":"'MPS_CVL NG'!$G$12","v":""}]
[null,null,"User Requires Access to Production, Model or Both",null,null,null,{"$f":"'MPS_CVL NG'!$H$12","v":""}]
[]
[]
[null,null,"Addl User Request"]
[null,null,"Full User Name",null,null,null,{"$f":"'MPS_CVL NG'!$A$12","v":""}]
[null,null,"User Email List",null,null,null,{"$f":"IF(G12<>\"\",'Systems Request'!$V$31,\"\")","v":""}]
[null,null,"Role (see Page 2 of form for descriptions)",null,null,null,{"$f":"'MPS_CVL NG'!$B$12","v":""}]
[null,null,"Internal User",null,null,null,"No"]
[null,null,"Business Justification for Access Requested:",null,null,null,{"$f":"'MPS_CVL NG'!$I$12","v":""}]
[null,null,"Grant Access to \"Producer Number(s)\" List all Needed",null,null,null,{"$f":"'MPS_CVL NG'!$J$12&\" \" & 'MPS_CVL NG'!$K$12","v":" "}]
[null,null,"Underwriter ID Needed (See Role Requirements):",null,null,null,{"$f":"IF('MPS_CVL NG'!$C$12=\"Yes\",\"Yes\",IF('MPS_CVL NG'!$B$12=\"PA Manager\",\"Yes\",IF('MPS_CVL NG'!$B$12=\"Underwriter PA\",\"Yes\",\"No\")))","v":"No"}]
[null,null,"Underwriter Access to \"Producer Number(s)\" only needed if Under ID requested):",null,null,null,{"$f":"IF(G18=\"Yes\",$G$17,\"\")","v":""}]
[null,null,"If View Only User - Name Source",null,null,null,{"$f":"IF('MPS_CVL NG'!$E$12=\"View Only\",'MPS_CVL NG'!$F$12,\"\")","v":""},"If Other",{"$f":"IF('MPS_CVL NG'!$F$12=\"Other\",'MPS_CVL NG'!$G$12,\"\")","v":""}]
[]
[]
[null,null,"Delete / Change User Request"]
[null,null,"Full User Name"]
[null,null,"Describe Change"]
[null,null,"Business Justification for Change Requested:"]
[null,null,"Effective Date of Change"]

{"sheet":"Coverall 8","index":10,"n_rows":27,"n_cols":9,"rows_kept":27,"cut":false,"hidden":true,"merged":[[26,2,26,4],[26,6,26,8],[22,2,22,8],[23,2,23,4],[23,6,23,8],[24,2,24,4],[24,6,24,8],[25,2,25,4],[25,6,25,8],[20,2,21,8],[14,2,14,4],[14,6,14,8],[15,2,15,4],[15,6,15,8],[16,2,16,4],[16,6,16,8],[17,2,17,4],[17,6,17,8],[18,2,18,4],[18,6,18,8],[19,2,19,4],[11,2,11,4],[11,6,11,8],[12,2,12,4],[12,6,12,8],[13,2,13,4],[13,6,13,8],[10,2,10,8],[2,2,2,8],[3,2,3,4],[3,6,3,8],[4,2,4,4],[4,6,4,8],[5,2,5,4],[5,6,5,8],[6,2,6,4],[6,6,6,8],[7,2,7,4],[7,6,7,8],[8,2,9,8]]}
[]
[]
[null,null,"Lexington MPS/CVL NG User Request Form"]
[null,null,"Request Type",null,null,null,"Add User"]
[null,null,"Request Date",null,null,null,{"$f":"'Systems Request'!$S$12","v":"00:00:00"}]
[null,null,"Request By (Must be user's manager)",null,null,null,{"$f":"'MPS_CVL NG'!$D$13","v":0}]
[null,null,"Classic, NexGen or Both",null,null,null,{"$f":"'MPS_CVL NG'!$G$13","v":""}]
[null,null,"User Requires Access to Production, Model or Both",null,null,null,{"$f":"'MPS_CVL NG'!$H$13","v":""}]
[]
[]
[null,null,"Addl User Request"]
[null,null,"Full User Name",null,null,null,{"$f":"'MPS_CVL NG'!$A$13","v":""}]
[null,null,"User Email List",null,null,null,{"$f":"IF(G12<>\"\",'Systems Request'!$V$32,\"\")","v":""}]
[null,null,"Role (see Page 2 of form for descriptions)",null,null,null,{"$f":"'MPS_CVL NG'!$B$13","v":""}]
[null,null,"Internal User",null,null,null,"No"]
[null,null,"Business Justification for Access Requested:",null,null,null,{"$f":"'MPS_CVL NG'!$I$13","v":""}]
[null,null,"Grant Access to \"Producer Number(s)\" List all Needed",null,null,null,{"$f":"'MPS_CVL NG'!$J$13&\" \" & 'MPS_CVL NG'!$K$13","v":" "}]
[null,null,"Underwriter ID Needed (See Role Requirements):",null,null,null,{"$f":"IF('MPS_CVL NG'!$C$13=\"Yes\",\"Yes\",IF('MPS_CVL NG'!$B$13=\"PA Manager\",\"Yes\",IF('MPS_CVL NG'!$B$13=\"Underwriter PA\",\"Yes\",\"No\")))","v":"No"}]
[null,null,"Underwriter Access to \"Producer Number(s)\" only needed if Under ID requested):",null,null,null,{"$f":"IF(G18=\"Yes\",$G$17,\"\")","v":""}]
[null,null,"If View Only User - Name Source",null,null,null,{"$f":"IF('MPS_CVL NG'!$E$13=\"View Only\",'MPS_CVL NG'!$F$13,\"\")","v":""},"If Other",{"$f":"IF('MPS_CVL NG'!$F$13=\"Other\",'MPS_CVL NG'!$G$13,\"\")","v":""}]
[]
[]
[null,null,"Delete / Change User Request"]
[null,null,"Full User Name"]
[null,null,"Describe Change"]
[null,null,"Business Justification for Change Requested:"]
[null,null,"Effective Date of Change"]

{"sheet":"Coverall 9","index":11,"n_rows":27,"n_cols":9,"rows_kept":27,"cut":false,"hidden":true,"merged":[[26,2,26,4],[26,6,26,8],[22,2,22,8],[23,2,23,4],[23,6,23,8],[24,2,24,4],[24,6,24,8],[25,2,25,4],[25,6,25,8],[20,2,21,8],[14,2,14,4],[14,6,14,8],[15,2,15,4],[15,6,15,8],[16,2,16,4],[16,6,16,8],[17,2,17,4],[17,6,17,8],[18,2,18,4],[18,6,18,8],[19,2,19,4],[11,2,11,4],[11,6,11,8],[12,2,12,4],[12,6,12,8],[13,2,13,4],[13,6,13,8],[10,2,10,8],[2,2,2,8],[3,2,3,4],[3,6,3,8],[4,2,4,4],[4,6,4,8],[5,2,5,4],[5,6,5,8],[6,2,6,4],[6,6,6,8],[7,2,7,4],[7,6,7,8],[8,2,9,8]]}
[]
[]
[null,null,"Lexington MPS/CVL NG User Request Form"]
[null,null,"Request Type",null,null,null,"Add User"]
[null,null,"Request Date",null,null,null,{"$f":"'Systems Request'!$S$12","v":"00:00:00"}]
[null,null,"Request By (Must be user's manager)",null,null,null,{"$f":"'MPS_CVL NG'!$D$14","v":0}]
[null,null,"Classic, NexGen or Both",null,null,null,{"$f":"'MPS_CVL NG'!$G$14","v":""}]
[null,null,"User Requires Access to Production, Model or Both",null,null,null,{"$f":"'MPS_CVL NG'!$H$14","v":""}]
[]
[]
[null,null,"Addl User Request"]
[null,null,"Full User Name",null,null,null,{"$f":"'MPS_CVL NG'!$A$14","v":""}]
[null,null,"User Email List",null,null,null,{"$f":"IF(G12<>\"\",'Systems Request'!$V$33,\"\")","v":""}]
[null,null,"Role (see Page 2 of form for descriptions)",null,null,null,{"$f":"'MPS_CVL NG'!$B$14","v":""}]
[null,null,"Internal User",null,null,null,"No"]
[null,null,"Business Justification for Access Requested:",null,null,null,{"$f":"'MPS_CVL NG'!$I$14","v":""}]
[null,null,"Grant Access to \"Producer Number(s)\" List all Needed",null,null,null,{"$f":"'MPS_CVL NG'!$J$14&\" \" & 'MPS_CVL NG'!$K$14","v":" "}]
[null,null,"Underwriter ID Needed (See Role Requirements):",null,null,null,{"$f":"IF('MPS_CVL NG'!$C$14=\"Yes\",\"Yes\",IF('MPS_CVL NG'!$B$14=\"PA Manager\",\"Yes\",IF('MPS_CVL NG'!$B$14=\"Underwriter PA\",\"Yes\",\"No\")))","v":"No"}]
[null,null,"Underwriter Access to \"Producer Number(s)\" only needed if Under ID requested):",null,null,null,{"$f":"IF(G18=\"Yes\",$G$17,\"\")","v":""}]
[null,null,"If View Only User - Name Source",null,null,null,{"$f":"IF('MPS_CVL NG'!$E$14=\"View Only\",'MPS_CVL NG'!$F$14,\"\")","v":""},"If Other",{"$f":"IF('MPS_CVL NG'!$F$14=\"Other\",'MPS_CVL NG'!$G$14,\"\")","v":""}]
[]
[]
[null,null,"Delete / Change User Request"]
[null,null,"Full User Name"]
[null,null,"Describe Change"]
[null,null,"Business Justification for Change Requested:"]
[null,null,"Effective Date of Change"]

{"sheet":"Coverall 10","index":12,"n_rows":27,"n_cols":9,"rows_kept":27,"cut":false,"hidden":true,"merged":[[26,2,26,4],[26,6,26,8],[22,2,22,8],[23,2,23,4],[23,6,23,8],[24,2,24,4],[24,6,24,8],[25,2,25,4],[25,6,25,8],[20,2,21,8],[14,2,14,4],[14,6,14,8],[15,2,15,4],[15,6,15,8],[16,2,16,4],[16,6,16,8],[17,2,17,4],[17,6,17,8],[18,2,18,4],[18,6,18,8],[19,2,19,4],[11,2,11,4],[11,6,11,8],[12,2,12,4],[12,6,12,8],[13,2,13,4],[13,6,13,8],[10,2,10,8],[2,2,2,8],[3,2,3,4],[3,6,3,8],[4,2,4,4],[4,6,4,8],[5,2,5,4],[5,6,5,8],[6,2,6,4],[6,6,6,8],[7,2,7,4],[7,6,7,8],[8,2,9,8]]}
[]
[]
[null,null,"Lexington MPS/CVL NG User Request Form"]
[null,null,"Request Type",null,null,null,"Add User"]
[null,null,"Request Date",null,null,null,{"$f":"'Systems Request'!$S$12","v":"00:00:00"}]
[null,null,"Request By (Must be user's manager)",null,null,null,{"$f":"'MPS_CVL NG'!$D$15","v":0}]
[null,null,"Classic, NexGen or Both",null,null,null,{"$f":"'MPS_CVL NG'!$G$15","v":""}]
[null,null,"User Requires Access to Production, Model or Both",null,null,null,{"$f":"'MPS_CVL NG'!$H$15","v":""}]
[]
[]
[null,null,"Addl User Request"]
[null,null,"Full User Name",null,null,null,{"$f":"'MPS_CVL NG'!$A$15","v":""}]
[null,null,"User Email List",null,null,null,{"$f":"IF(G12<>\"\",'Systems Request'!$V$34,\"\")","v":""}]
[null,null,"Role (see Page 2 of form for descriptions)",null,null,null,{"$f":"'MPS_CVL NG'!$B$15","v":""}]
[null,null,"Internal User",null,null,null,"No"]
[null,null,"Business Justification for Access Requested:",null,null,null,{"$f":"'MPS_CVL NG'!$I$15","v":""}]
[null,null,"Grant Access to \"Producer Number(s)\" List all Needed",null,null,null,{"$f":"'MPS_CVL NG'!$J$15&\" \" & 'MPS_CVL NG'!$K$15","v":" "}]
[null,null,"Underwriter ID Needed (See Role Requirements):",null,null,null,{"$f":"IF('MPS_CVL NG'!$C$15=\"Yes\",\"Yes\",IF('MPS_CVL NG'!$B$15=\"PA Manager\",\"Yes\",IF('MPS_CVL NG'!$B$15=\"Underwriter PA\",\"Yes\",\"No\")))","v":"No"}]
[null,null,"Underwriter Access to \"Producer Number(s)\" only needed if Under ID requested):",null,null,null,{"$f":"IF(G18=\"Yes\",$G$17,\"\")","v":""}]
[null,null,"If View Only User - Name Source",null,null,null,{"$f":"IF('MPS_CVL NG'!$E$15=\"View Only\",'MPS_CVL NG'!$F$15,\"\")","v":""},"If Other",{"$f":"IF('MPS_CVL NG'!$F$15=\"Other\",'MPS_CVL NG'!$G$15,\"\")","v":""}]
[]
[]
[null,null,"Delete / Change User Request"]
[null,null,"Full User Name"]
[null,null,"Describe Change"]
[null,null,"Business Justification for Change Requested:"]
[null,null,"Effective Date of Change"]

{"sheet":"Dropdowns","index":13,"n_rows":12,"n_cols":9,"rows_kept":12,"cut":false,"hidden":true,"merged":[]}
["Select Job Function",null,"MPS/CVL Role",null,"View Source",null,"MPS/CVL Version",null,"Access to Production, Model or Both"]
["Agency Executive (President/CEO)",null,"Select Role",null,"AIG Claims",null,"Select MPS/CVL Version",null,"Select Access"]
["Operations Manager",null,"View Only",null,"GB Claims",null,"NexGen",null,"Production"]
["IT Manager",null,"Underwriter Assistant",null,"York Claims",null,null,null,"Model"]
["Underwriting Manager",null,"Underwriter PA",null,"Premium Audit",null,null,null,"Both"]
["Underwriter",null,"PA Manager",null,"Lex Accounting"]
["Underwriting Assistant",null,"UW Codes",null,"Other"]
[null,null,null,null,"NA"]
["Select Yes or No",null,null,null,"Select Source"]
["Yes"]
["No"]
["NA"]