{"text_format":"1","workbook":"xlsx","n_sheets":14,"sheets":["Systems Request","Coverall","Internal Systems Request","Coverall 1","Coverall 2","Coverall 3","Coverall 4","Coverall 5","Coverall 6","Coverall 7","Coverall 8","Coverall 9","Coverall 10","Dropdowns"],"not_rendered":{"charts":0,"images":2,"macros":1,"external_links":0,"defined_names":1,"comments":0,"pivot_tables":0},"unopened":[],"bounds":{"document_bytes":16777216,"sheet_cells":100000,"rows_first":2000,"rows_last":500,"rows_between":2000,"halvings":0,"cell_chars":16384,"cell_head_chars":4096},"cells_cut":0,"cells_raw":0,"read":"whole","date_system":"1900"}

{"sheet":"Systems Request","index":0,"n_rows":29,"n_cols":20,"rows_kept":29,"cut":false,"hidden":false,"merged":[[1,13,3,17],[10,0,10,4],[11,0,11,4],[7,14,7,15],[8,14,8,15],[6,5,6,12],[7,5,7,12],[8,5,8,12],[9,5,9,12],[10,5,10,12],[11,5,11,12],[6,0,6,4],[7,0,7,4],[8,0,8,4],[9,0,9,4],[6,17,6,18],[15,17,18,17],[15,18,18,18],[15,13,18,13],[15,14,18,14],[15,15,18,15],[15,16,18,16],[16,9,18,9],[16,10,18,10],[16,11,18,11],[16,12,18,12],[6,14,6,15],[15,0,15,12],[16,5,18,5],[16,6,18,6],[16,7,18,7],[16,8,18,8],[9,14,9,15],[16,0,18,0],[16,1,18,1],[16,2,18,2],[16,3,18,3],[16,4,18,4]]}
[]
[null,null,null,null,null,null,null,null,null,null,null,null,null,"Systems Request"]
[]
[]
[]
[]
["Brokerage",null,null,null,null,null,null,null,null,null,null,null,null,null,"National Producer Number",null,null,"Make sure to enable content"]
["Address",null,null,null,null,null,null,null,null,null,null,null,null,null,"Producer Number"]
{"$rows_left_out":22}
{"sheet":"Coverall","index":1,"n_rows":47,"n_cols":11,"rows_kept":47,"cut":false,"hidden":false,"merged":[]}
[]
[]
[]
[]
["Name","Select Coverall Role-See below for Role Descriptions","Optional Underwriter ID?","User's Manager or Program Manager","For \"View Only\" Role","If Source is \"other\" Identify Source","Classic, NexGen or Both","User Requires Access to Production, Model or Both","Business Justification for Access Granted","Grant Access to Producer Number","Enter Additional Producer Numbers if Needed"]
[{"$f":"IF('Systems Request'!E20=\"X\",'Systems Request'!N20&\" \" & 'Systems Request'!P20&\" \" &'Systems Request'!O20,\"\")","v":""},{"$f":"IF(A6<>\"\",\"Select Role\",\"\")","v":""},{"$f":"IF(B6=\"Underwriter Assistant\",\"Select Yes or No\",\"\")","v":""},null,{"$f":"IF(A6<>\"\",\"Select Source\",\"\")","v":""},{"$f":"IF(E6=\"Other\",\"Enter Source\",\"NA\")","v":"NA"},{"$f":"IF(A6<>\"\",\"Select Coverall Version\",\"\")","v":""},{"$f":"IF(A6<>\"\",\"Select Access\",\"\")","v":""},null,{"$f":"IF('Systems Request'!E20=\"X\",'Systems Request'!Q8,\"\")","v":""}]
[{"$f":"IF('Systems Request'!E21=\"X\",'Systems Request'!N21&\" \" & 'Systems Request'!P21&\" \" &'Systems Request'!O21,\"\")","v":""},{"$f":"IF(A7<>\"\",\"Select Role\",\"\")","v":""},{"$f":"IF(B7=\"Underwriter Assistant\",\"Select Yes or No\",\"\")","v":""},null,{"$f":"IF(A7<>\"\",\"Select Source\",\"\")","v":""},{"$f":"IF(E7=\"Other\",\"Enter Source\",\"NA\")","v":"NA"},"","",null,{"$f":"IF('Systems Request'!E21=\"X\",'Systems Request'!Q8,\"\")","v":""}]
[{"$f":"IF('Systems Request'!E22=\"X\",'Systems Request'!N22&\" \" & 'Systems Request'!P22&\" \" &'Systems Request'!O22,\"\")","v":""},{"$f":"IF(A8<>\"\",\"Select Role\",\"\")","v":""},"",null,"","NA","","",{"$f":"IF(A8<>\"\",\"Enter Business Justification\",\"\")","v":""},{"$f":"IF('Systems Request'!E22=\"X\",'Systems Request'!Q8,\"\")","v":""}]
{"$rows_left_out":40}
{"sheet":"Internal Systems Request","index":2,"n_rows":30,"n_cols":29,"rows_kept":30,"cut":false,"hidden":true,"merged":[[1,3,3,3],[1,0,3,0],[1,1,3,1],[0,17,3,17],[0,18,3,18],[1,4,3,4],[1,5,3,5],[0,13,3,13],[0,14,3,14],[1,12,3,12],[1,10,3,10],[0,0,0,12],[0,16,3,16],[1,2,3,2],[0,28,3,28],[0,19,3,19],[0,20,3,20],[1,6,3,6],[0,22,3,22],[1,8,3,8],[0,24,3,24],[1,7,3,7],[0,21,3,21],[1,9,3,9],[0,23,3,23],[0,15,3,15],[1,11,3,11],[0,26,3,26],[0,27,3,27],[0,25,3,25]]}
["Systems Requested",null,null,null,null,null,null,null,null,null,null,null,null,"Last Name","First Name","Middle Initial","Job Function","National Producer Number","States Licensed","Brokerage","Address1","Address2","City","State","Postal Code","Phone #","Internet Address","Producer \nCode","Mainframe ID"]
["ALIR - DMV","E-Start","ODEN PT","MVR","Coverall","Intellirisk","ISO SPI Plus","Mainframe","Marshall & Swift","Risk Meter","NOR (Online\nRegistries &\nMotor Carrier)","E-Delivery","PA Portal"]
[]
[]
[{"$f":"IF('Systems Request'!A20<>\"\",'Systems Request'!A20,\"\")","v":""},{"$f":"IF('Systems Request'!B20<>\"\",'Systems Request'!B20,\"\")","v":""},{"$f":"IF('Systems Request'!C20<>\"\",'Systems Request'!C20,\"\")","v":""},{"$f":"IF('Systems Request'!D20<>\"\",'Systems Request'!D20,\"\")","v":""},{"$f":"IF('Systems Request'!E20<>\"\",'Systems Request'!E20,\"\")","v":""},{"$f":"IF('Systems Request'!F20<>\"\",'Systems Request'!F20,\"\")","v":""},{"$f":"IF('Systems Request'!G20<>\"\",'Systems Request'!G20,\"\")","v":""},{"$f":"IF('Systems Request'!H20<>\"\",'Systems Request'!H20,\"\")","v":""},{"$f":"IF('Systems Request'!I20<>\"\",'Systems Request'!I20,\"\")","v":""},{"$f":"IF('Systems Request'!J20<>\"\",'Systems Request'!J20,\"\")","v":""},{"$f":"IF('Systems Request'!K20<>\"\",'Systems Request'!K20,\"\")","v":""},{"$f":"IF('Systems Request'!L20<>\"\",'Systems Request'!L20,\"\")","v":""},{"$f":"IF('Systems Request'!M20<>\"\",'Systems Request'!M20,\"\")","v":""},{"$f":"IF('Systems Request'!O20<>\"\",'Systems Request'!O20,\"\")","v":""},{"$f":"IF('Systems Request'!N20<>\"\",'Systems Request'!N20,\"\")","v":""},{"$f":"IF('Systems Request'!P20<>\"\",'Systems Request'!P20,\"\")","v":""},{"$f":"IF('Systems Request'!Q20<>\"\",'Systems Request'!Q20,\"\")","v":"Select Job Function"},{"$f":"IF('Systems Request'!N20<>\"\",'Systems Request'!Q$7,\"\")","v":""},{"$f":"IF('Systems Request'!N20<>\"\",'Systems Request'!$Q$9,\"\")","v":""},{"$f":"IF('Systems Request'!N20<>\"\",'Systems Request'!$F$7,\"\")","v":""},{"$f":"IF('Systems Request'!N20<>\"\",'Systems Request'!$F$8,\"\")","v":""},{"$f":"IF('Systems Request'!N20<>\"\",'Systems Request'!$F$9,\"\")","v":""},{"$f":"IF('Systems Request'!N20<>\"\",'Systems Request'!$F$10,\"\")","v":""},{"$f":"IF('Systems Request'!N20<>\"\",'Systems Request'!$F$11,\"\")","v":""},{"$f":"IF('Systems Request'!N20<>\"\",'Systems Request'!$F$12,\"\")","v":""},{"$f":"IF('Systems Request'!N20<>\"\",'Systems Request'!$R$20,\"\")","v":""},{"$f":"IF('Systems Request'!N20<>\"\",'Systems Request'!$S$20,\"\")","v":""},{"$f":"IF('Systems Request'!N20<>\"\",'Systems Request'!$P$8,\"\")","v":""},{"$f":"IF('Systems Request'!N20<>\"\",\"Assign Mainframe ID\",\"\")","v":""}]
[{"$f":"IF('Systems Request'!A21<>\"\",'Systems Request'!A21,\"\")","v":""},{"$f":"IF('Systems Request'!B21<>\"\",'Systems Request'!B21,\"\")","v":""},{"$f":"IF('Systems Request'!C21<>\"\",'Systems Request'!C21,\"\")","v":""},{"$f":"IF('Systems Request'!D21<>\"\",'Systems Request'!D21,\"\")","v":""},{"$f":"IF('Systems Request'!E21<>\"\",'Systems Request'!E21,\"\")","v":""},{"$f":"IF('Systems Request'!F21<>\"\",'Systems Request'!F21,\"\")","v":""},{"$f":"IF('Systems Request'!G21<>\"\",'Systems Request'!G21,\"\")","v":""},{"$f":"IF('Systems Request'!H21<>\"\",'Systems Request'!H21,\"\")","v":""},{"$f":"IF('Systems Request'!I21<>\"\",'Systems Request'!I21,\"\")","v":""},{"$f":"IF('Systems Request'!J21<>\"\",'Systems Request'!J21,\"\")","v":""},{"$f":"IF('Systems Request'!K21<>\"\",'Systems Request'!K21,\"\")","v":""},{"$f":"IF('Systems Request'!L21<>\"\",'Systems Request'!L21,\"\")","v":""},{"$f":"IF('Systems Request'!M21<>\"\",'Systems Request'!M21,\"\")","v":""},{"$f":"IF('Systems Request'!O21<>\"\",'Systems Request'!O21,\"\")","v":""},{"$f":"IF('Systems Request'!N21<>\"\",'Systems Request'!N21,\"\")","v":""},{"$f":"IF('Systems Request'!P21<>\"\",'Systems Request'!P21,\"\")","v":""},{"$f":"IF('Systems Request'!Q21<>\"\",'Systems Request'!Q21,\"\")","v":"Select Job Function"},{"$f":"IF('Systems Request'!N21<>\"\",'Systems Request'!Q$7,\"\")","v":""},{"$f":"IF('Systems Request'!N21<>\"\",'Systems Request'!$Q$9,\"\")","v":""},{"$f":"IF('Systems Request'!N21<>\"\",'Systems Request'!$F$7,\"\")","v":""},{"$f":"IF('Systems Request'!N21<>\"\",'Systems Request'!$F$8,\"\")","v":""},{"$f":"IF('Systems Request'!N21<>\"\",'Systems Request'!$F$9,\"\")","v":""},{"$f":"IF('Systems Request'!N21<>\"\",'Systems Request'!$F$10,\"\")","v":""},{"$f":"IF('Systems Request'!N21<>\"\",'Systems Request'!$F$11,\"\")","v":""},{"$f":"IF('Systems Request'!N21<>\"\",'Systems Request'!$F$12,\"\")","v":""},{"$f":"IF('Systems Request'!N21<>\"\",'Systems Request'!$R$21,\"\")","v":""},{"$f":"IF('Systems Request'!N21<>\"\",'Systems Request'!$S$21,\"\")","v":""},{"$f":"IF('Systems Request'!N21<>\"\",'Systems Request'!$P$8,\"\")","v":""},{"$f":"IF('Systems Request'!N21<>\"\",\"Assign Mainframe ID\",\"\")","v":""}]
[{"$f":"IF('Systems Request'!A22<>\"\",'Systems Request'!A22,\"\")","v":""},{"$f":"IF('Systems Request'!B22<>\"\",'Systems Request'!B22,\"\")","v":""},{"$f":"IF('Systems Request'!C22<>\"\",'Systems Request'!C22,\"\")","v":""},{"$f":"IF('Systems Request'!D22<>\"\",'Systems Request'!D22,\"\")","v":""},{"$f":"IF('Systems Request'!E22<>\"\",'Systems Request'!E22,\"\")","v":""},{"$f":"IF('Systems Request'!F22<>\"\",'Systems Request'!F22,\"\")","v":""},{"$f":"IF('Systems Request'!G22<>\"\",'Systems Request'!G22,\"\")","v":""},{"$f":"IF('Systems Request'!H22<>\"\",'Systems Request'!H22,\"\")","v":""},{"$f":"IF('Systems Request'!I22<>\"\",'Systems Request'!I22,\"\")","v":""},{"$f":"IF('Systems Request'!J22<>\"\",'Systems Request'!J22,\"\")","v":""},{"$f":"IF('Systems Request'!K22<>\"\",'Systems Request'!K22,\"\")","v":""},{"$f":"IF('Systems Request'!L22<>\"\",'Systems Request'!L22,\"\")","v":""},{"$f":"IF('Systems Request'!M22<>\"\",'Systems Request'!M22,\"\")","v":""},{"$f":"IF('Systems Request'!O22<>\"\",'Systems Request'!O22,\"\")","v":""},{"$f":"IF('Systems Request'!N22<>\"\",'Systems Request'!N22,\"\")","v":""},{"$f":"IF('Systems Request'!P22<>\"\",'Systems Request'!P22,\"\")","v":""},{"$f":"IF('Systems Request'!Q22<>\"\",'Systems Request'!Q22,\"\")","v":"Select Job Function"},{"$f":"IF('Systems Request'!N22<>\"\",'Systems Request'!Q$7,\"\")","v":""},{"$f":"IF('Systems Request'!N22<>\"\",'Systems Request'!$Q$9,\"\")","v":""},{"$f":"IF('Systems Request'!N22<>\"\",'Systems Request'!$F$7,\"\")","v":""},{"$f":"IF('Systems Request'!N22<>\"\",'Systems Request'!$F$8,\"\")","v":""},{"$f":"IF('Systems Request'!N22<>\"\",'Systems Request'!$F$9,\"\")","v":""},{"$f":"IF('Systems Request'!N22<>\"\",'Systems Request'!$F$10,\"\")","v":""},{"$f":"IF('Systems Request'!N22<>\"\",'Systems Request'!$F$11,\"\")","v":""},{"$f":"IF('Systems Request'!N22<>\"\",'Systems Request'!$F$12,\"\")","v":""},{"$f":"IF('Systems Request'!N22<>\"\",'Systems Request'!$R$22,\"\")","v":""},{"$f":"IF('Systems Request'!N22<>\"\",'Systems Request'!$S$22,\"\")","v":""},{"$f":"IF('Systems Request'!N22<>\"\",'Systems Request'!$P$8,\"\")","v":""},{"$f":"IF('Systems Request'!N22<>\"\",\"Assign Mainframe ID\",\"\")","v":""}]
[{"$f":"IF('Systems Request'!A23<>\"\",'Systems Request'!A23,\"\")","v":""},{"$f":"IF('Systems Request'!B23<>\"\",'Systems Request'!B23,\"\")","v":""},{"$f":"IF('Systems Request'!C23<>\"\",'Systems Request'!C23,\"\")","v":""},{"$f":"IF('Systems Request'!D23<>\"\",'Systems Request'!D23,\"\")","v":""},{"$f":"IF('Systems Request'!E23<>\"\",'Systems Request'!E23,\"\")","v":""},{"$f":"IF('Systems Request'!F23<>\"\",'Systems Request'!F23,\"\")","v":""},{"$f":"IF('Systems Request'!G23<>\"\",'Systems Request'!G23,\"\")","v":""},{"$f":"IF('Systems Request'!H23<>\"\",'Systems Request'!H23,\"\")","v":""},{"$f":"IF('Systems Request'!I23<>\"\",'Systems Request'!I23,\"\")","v":""},{"$f":"IF('Systems Request'!J23<>\"\",'Systems Request'!J23,\"\")","v":""},{"$f":"IF('Systems Request'!K23<>\"\",'Systems Request'!K23,\"\")","v":""},{"$f":"IF('Systems Request'!L23<>\"\",'Systems Request'!L23,\"\")","v":""},{"$f":"IF('Systems Request'!M23<>\"\",'Systems Request'!M23,\"\")","v":""},{"$f":"IF('Systems Request'!O23<>\"\",'Systems Request'!O23,\"\")","v":""},{"$f":"IF('Systems Request'!N23<>\"\",'Systems Request'!N23,\"\")","v":""},{"$f":"IF('Systems Request'!P23<>\"\",'Systems Request'!P23,\"\")","v":""},{"$f":"IF('Systems Request'!Q23<>\"\",'Systems Request'!Q23,\"\")","v":"Select Job Function"},{"$f":"IF('Systems Request'!N23<>\"\",'Systems Request'!Q$7,\"\")","v":""},{"$f":"IF('Systems Request'!N23<>\"\",'Systems Request'!$Q$9,\"\")","v":""},{"$f":"IF('Systems Request'!N23<>\"\",'Systems Request'!$F$7,\"\")","v":""},{"$f":"IF('Systems Request'!N23<>\"\",'Systems Request'!$F$8,\"\")","v":""},{"$f":"IF('Systems Request'!N23<>\"\",'Systems Request'!$F$9,\"\")","v":""},{"$f":"IF('Systems Request'!N23<>\"\",'Systems Request'!$F$10,\"\")","v":""},{"$f":"IF('Systems Request'!N23<>\"\",'Systems Request'!$F$11,\"\")","v":""},{"$f":"IF('Systems Request'!N23<>\"\",'Systems Request'!$F$12,\"\")","v":""},{"$f":"IF('Systems Request'!N23<>\"\",'Systems Request'!$R$23,\"\")","v":""},{"$f":"IF('Systems Request'!N23<>\"\",'Systems Request'!$S$23,\"\")","v":""},{"$f":"IF('Systems Request'!N23<>\"\",'Systems Request'!$P$8,\"\")","v":""},{"$f":"IF('Systems Request'!N23<>\"\",\"Assign Mainframe ID\",\"\")","v":""}]
{"$rows_left_out":23}
{"sheet":"Coverall 1","index":3,"n_rows":27,"n_cols":9,"rows_kept":27,"cut":false,"hidden":true,"merged":[[26,2,26,4],[26,6,26,8],[20,2,21,8],[22,2,22,8],[23,2,23,4],[23,6,23,8],[25,2,25,4],[25,6,25,8],[24,2,24,4],[24,6,24,8],[17,2,17,4],[17,6,17,8],[18,2,18,4],[18,6,18,8],[19,2,19,4],[14,2,14,4],[14,6,14,8],[15,2,15,4],[15,6,15,8],[16,2,16,4],[16,6,16,8],[13,2,13,4],[13,6,13,8],[7,2,7,4],[4,6,4,8],[5,6,5,8],[6,6,6,8],[7,6,7,8],[8,2,9,8],[6,2,6,4],[10,2,10,8],[11,2,11,4],[11,6,11,8],[12,2,12,4],[12,6,12,8],[2,2,2,8],[3,2,3,4],[3,6,3,8],[4,2,4,4],[5,2,5,4]]}
[]
[]
[null,null,"Lexington Cover-All User Request Form"]
[null,null,"Request Type",null,null,null,"Add User"]
[null,null,"Request Date",null,null,null,{"$f":"'Systems Request'!$Q$10","v":"00:00:00"}]
[null,null,"Request By (Must be user's manager)",null,null,null,{"$f":"Coverall!$D$6","v":0}]
[null,null,"Classic, NexGen or Both",null,null,null,{"$f":"Coverall!$G$6","v":""}]
[null,null,"User Requires Access to Production, Model or Both",null,null,null,{"$f":"Coverall!$H$6","v":""}]
{"$rows_left_out":20}
{"sheet":"Coverall 2","index":4,"n_rows":27,"n_cols":9,"rows_kept":27,"cut":false,"hidden":true,"merged":[[26,2,26,4],[26,6,26,8],[22,2,22,8],[23,2,23,4],[23,6,23,8],[24,2,24,4],[24,6,24,8],[25,2,25,4],[25,6,25,8],[20,2,21,8],[14,2,14,4],[14,6,14,8],[15,2,15,4],[15,6,15,8],[16,2,16,4],[16,6,16,8],[17,2,17,4],[17,6,17,8],[18,2,18,4],[18,6,18,8],[19,2,19,4],[11,2,11,4],[11,6,11,8],[12,2,12,4],[12,6,12,8],[13,2,13,4],[13,6,13,8],[10,2,10,8],[2,2,2,8],[3,2,3,4],[3,6,3,8],[4,2,4,4],[4,6,4,8],[5,2,5,4],[5,6,5,8],[6,2,6,4],[6,6,6,8],[7,2,7,4],[7,6,7,8],[8,2,9,8]]}
[]
[]
[null,null,"Lexington Cover-All User Request Form"]
[null,null,"Request Type",null,null,null,"Add User"]
[null,null,"Request Date",null,null,null,{"$f":"'Systems Request'!$Q$10","v":"00:00:00"}]
[null,null,"Request By (Must be user's manager)",null,null,null,{"$f":"Coverall!$D$7","v":0}]
[null,null,"Classic, NexGen or Both",null,null,null,{"$f":"Coverall!$G$7","v":""}]
[null,null,"User Requires Access to Production, Model or Both",null,null,null,{"$f":"Coverall!$H$7","v":""}]
{"$rows_left_out":20}
{"sheet":"Coverall 3","index":5,"n_rows":27,"n_cols":9,"rows_kept":27,"cut":false,"hidden":true,"merged":[[26,2,26,4],[26,6,26,8],[22,2,22,8],[23,2,23,4],[23,6,23,8],[24,2,24,4],[24,6,24,8],[25,2,25,4],[25,6,25,8],[20,2,21,8],[14,2,14,4],[14,6,14,8],[15,2,15,4],[15,6,15,8],[16,2,16,4],[16,6,16,8],[17,2,17,4],[17,6,17,8],[18,2,18,4],[18,6,18,8],[19,2,19,4],[11,2,11,4],[11,6,11,8],[12,2,12,4],[12,6,12,8],[13,2,13,4],[13,6,13,8],[10,2,10,8],[2,2,2,8],[3,2,3,4],[3,6,3,8],[4,2,4,4],[4,6,4,8],[5,2,5,4],[5,6,5,8],[6,2,6,4],[6,6,6,8],[7,2,7,4],[7,6,7,8],[8,2,9,8]]}
[]
[]
[null,null,"Lexington Cover-All User Request Form"]
[null,null,"Request Type",null,null,null,"Add User"]
[null,null,"Request Date",null,null,null,{"$f":"'Systems Request'!$Q$10","v":"00:00:00"}]
[null,null,"Request By (Must be user's manager)",null,null,null,{"$f":"Coverall!$D$8","v":0}]
[null,null,"Classic, NexGen or Both",null,null,null,{"$f":"Coverall!$G$8","v":""}]
[null,null,"User Requires Access to Production, Model or Both",null,null,null,{"$f":"Coverall!$H$8","v":""}]
{"$rows_left_out":20}
{"sheet":"Coverall 4","index":6,"n_rows":27,"n_cols":9,"rows_kept":27,"cut":false,"hidden":true,"merged":[[26,2,26,4],[26,6,26,8],[22,2,22,8],[23,2,23,4],[23,6,23,8],[24,2,24,4],[24,6,24,8],[25,2,25,4],[25,6,25,8],[20,2,21,8],[14,2,14,4],[14,6,14,8],[15,2,15,4],[15,6,15,8],[16,2,16,4],[16,6,16,8],[17,2,17,4],[17,6,17,8],[18,2,18,4],[18,6,18,8],[19,2,19,4],[11,2,11,4],[11,6,11,8],[12,2,12,4],[12,6,12,8],[13,2,13,4],[13,6,13,8],[10,2,10,8],[2,2,2,8],[3,2,3,4],[3,6,3,8],[4,2,4,4],[4,6,4,8],[5,2,5,4],[5,6,5,8],[6,2,6,4],[6,6,6,8],[7,2,7,4],[7,6,7,8],[8,2,9,8]]}
[]
[]
[null,null,"Lexington Cover-All User Request Form"]
[null,null,"Request Type",null,null,null,"Add User"]
[null,null,"Request Date",null,null,null,{"$f":"'Systems Request'!$Q$10","v":"00:00:00"}]
[null,null,"Request By (Must be user's manager)",null,null,null,{"$f":"Coverall!$D$9","v":0}]
[null,null,"Classic, NexGen or Both",null,null,null,{"$f":"Coverall!$G$9","v":""}]
[null,null,"User Requires Access to Production, Model or Both",null,null,null,{"$f":"Coverall!$H$9","v":""}]
{"$rows_left_out":20}
{"sheet":"Coverall 5","index":7,"n_rows":27,"n_cols":9,"rows_kept":27,"cut":false,"hidden":true,"merged":[[26,2,26,4],[26,6,26,8],[22,2,22,8],[23,2,23,4],[23,6,23,8],[24,2,24,4],[24,6,24,8],[25,2,25,4],[25,6,25,8],[20,2,21,8],[14,2,14,4],[14,6,14,8],[15,2,15,4],[15,6,15,8],[16,2,16,4],[16,6,16,8],[17,2,17,4],[17,6,17,8],[18,2,18,4],[18,6,18,8],[19,2,19,4],[11,2,11,4],[11,6,11,8],[12,2,12,4],[12,6,12,8],[13,2,13,4],[13,6,13,8],[10,2,10,8],[2,2,2,8],[3,2,3,4],[3,6,3,8],[4,2,4,4],[4,6,4,8],[5,2,5,4],[5,6,5,8],[6,2,6,4],[6,6,6,8],[7,2,7,4],[7,6,7,8],[8,2,9,8]]}
[]
[]
[null,null,"Lexington Cover-All User Request Form"]
[null,null,"Request Type",null,null,null,"Add User"]
[null,null,"Request Date",null,null,null,{"$f":"'Systems Request'!$Q$10","v":"00:00:00"}]
[null,null,"Request By (Must be user's manager)",null,null,null,{"$f":"Coverall!$D$10","v":0}]
[null,null,"Classic, NexGen or Both",null,null,null,{"$f":"Coverall!$G$10","v":""}]
[null,null,"User Requires Access to Production, Model or Both",null,null,null,{"$f":"Coverall!$H$10","v":""}]
{"$rows_left_out":20}
{"sheet":"Coverall 6","index":8,"n_rows":27,"n_cols":9,"rows_kept":27,"cut":false,"hidden":true,"merged":[[26,2,26,4],[26,6,26,8],[22,2,22,8],[23,2,23,4],[23,6,23,8],[24,2,24,4],[24,6,24,8],[25,2,25,4],[25,6,25,8],[20,2,21,8],[14,2,14,4],[14,6,14,8],[15,2,15,4],[15,6,15,8],[16,2,16,4],[16,6,16,8],[17,2,17,4],[17,6,17,8],[18,2,18,4],[18,6,18,8],[19,2,19,4],[11,2,11,4],[11,6,11,8],[12,2,12,4],[12,6,12,8],[13,2,13,4],[13,6,13,8],[10,2,10,8],[2,2,2,8],[3,2,3,4],[3,6,3,8],[4,2,4,4],[4,6,4,8],[5,2,5,4],[5,6,5,8],[6,2,6,4],[6,6,6,8],[7,2,7,4],[7,6,7,8],[8,2,9,8]]}
[]
[]
[null,null,"Lexington Cover-All User Request Form"]
[null,null,"Request Type",null,null,null,"Add User"]
[null,null,"Request Date",null,null,null,{"$f":"'Systems Request'!$Q$10","v":"00:00:00"}]
[null,null,"Request By (Must be user's manager)",null,null,null,{"$f":"Coverall!$D$11","v":0}]
[null,null,"Classic, NexGen or Both",null,null,null,{"$f":"Coverall!$G$11","v":""}]
[null,null,"User Requires Access to Production, Model or Both",null,null,null,{"$f":"Coverall!$H$11","v":""}]
{"$rows_left_out":20}
{"sheet":"Coverall 7","index":9,"n_rows":27,"n_cols":9,"rows_kept":27,"cut":false,"hidden":true,"merged":[[26,2,26,4],[26,6,26,8],[22,2,22,8],[23,2,23,4],[23,6,23,8],[24,2,24,4],[24,6,24,8],[25,2,25,4],[25,6,25,8],[20,2,21,8],[14,2,14,4],[14,6,14,8],[15,2,15,4],[15,6,15,8],[16,2,16,4],[16,6,16,8],[17,2,17,4],[17,6,17,8],[18,2,18,4],[18,6,18,8],[19,2,19,4],[11,2,11,4],[11,6,11,8],[12,2,12,4],[12,6,12,8],[13,2,13,4],[13,6,13,8],[10,2,10,8],[2,2,2,8],[3,2,3,4],[3,6,3,8],[4,2,4,4],[4,6,4,8],[5,2,5,4],[5,6,5,8],[6,2,6,4],[6,6,6,8],[7,2,7,4],[7,6,7,8],[8,2,9,8]]}
[]
[]
[null,null,"Lexington Cover-All User Request Form"]
[null,null,"Request Type",null,null,null,"Add User"]
[null,null,"Request Date",null,null,null,{"$f":"'Systems Request'!$Q$10","v":"00:00:00"}]
[null,null,"Request By (Must be user's manager)",null,null,null,{"$f":"Coverall!$D$12","v":0}]
[null,null,"Classic, NexGen or Both",null,null,null,{"$f":"Coverall!$G$12","v":""}]
[null,null,"User Requires Access to Production, Model or Both",null,null,null,{"$f":"Coverall!$H$12","v":""}]
{"$rows_left_out":20}
{"sheet":"Coverall 8","index":10,"n_rows":27,"n_cols":9,"rows_kept":27,"cut":false,"hidden":true,"merged":[[26,2,26,4],[26,6,26,8],[22,2,22,8],[23,2,23,4],[23,6,23,8],[24,2,24,4],[24,6,24,8],[25,2,25,4],[25,6,25,8],[20,2,21,8],[14,2,14,4],[14,6,14,8],[15,2,15,4],[15,6,15,8],[16,2,16,4],[16,6,16,8],[17,2,17,4],[17,6,17,8],[18,2,18,4],[18,6,18,8],[19,2,19,4],[11,2,11,4],[11,6,11,8],[12,2,12,4],[12,6,12,8],[13,2,13,4],[13,6,13,8],[10,2,10,8],[2,2,2,8],[3,2,3,4],[3,6,3,8],[4,2,4,4],[4,6,4,8],[5,2,5,4],[5,6,5,8],[6,2,6,4],[6,6,6,8],[7,2,7,4],[7,6,7,8],[8,2,9,8]]}
[]
[]
[null,null,"Lexington Cover-All User Request Form"]
[null,null,"Request Type",null,null,null,"Add User"]
[null,null,"Request Date",null,null,null,{"$f":"'Systems Request'!$Q$10","v":"00:00:00"}]
[null,null,"Request By (Must be user's manager)",null,null,null,{"$f":"Coverall!$D$13","v":0}]
[null,null,"Classic, NexGen or Both",null,null,null,{"$f":"Coverall!$G$13","v":""}]
[null,null,"User Requires Access to Production, Model or Both",null,null,null,{"$f":"Coverall!$H$13","v":""}]
{"$rows_left_out":20}
{"sheet":"Coverall 9","index":11,"n_rows":27,"n_cols":9,"rows_kept":27,"cut":false,"hidden":true,"merged":[[26,2,26,4],[26,6,26,8],[22,2,22,8],[23,2,23,4],[23,6,23,8],[24,2,24,4],[24,6,24,8],[25,2,25,4],[25,6,25,8],[20,2,21,8],[14,2,14,4],[14,6,14,8],[15,2,15,4],[15,6,15,8],[16,2,16,4],[16,6,16,8],[17,2,17,4],[17,6,17,8],[18,2,18,4],[18,6,18,8],[19,2,19,4],[11,2,11,4],[11,6,11,8],[12,2,12,4],[12,6,12,8],[13,2,13,4],[13,6,13,8],[10,2,10,8],[2,2,2,8],[3,2,3,4],[3,6,3,8],[4,2,4,4],[4,6,4,8],[5,2,5,4],[5,6,5,8],[6,2,6,4],[6,6,6,8],[7,2,7,4],[7,6,7,8],[8,2,9,8]]}
[]
[]
[null,null,"Lexington Cover-All User Request Form"]
[null,null,"Request Type",null,null,null,"Add User"]
[null,null,"Request Date",null,null,null,{"$f":"'Systems Request'!$Q$10","v":"00:00:00"}]
[null,null,"Request By (Must be user's manager)",null,null,null,{"$f":"Coverall!$D$14","v":0}]
[null,null,"Classic, NexGen or Both",null,null,null,{"$f":"Coverall!$G$14","v":""}]
[null,null,"User Requires Access to Production, Model or Both",null,null,null,{"$f":"Coverall!$H$14","v":""}]
{"$rows_left_out":20}
{"sheet":"Coverall 10","index":12,"n_rows":27,"n_cols":9,"rows_kept":27,"cut":false,"hidden":true,"merged":[[26,2,26,4],[26,6,26,8],[22,2,22,8],[23,2,23,4],[23,6,23,8],[24,2,24,4],[24,6,24,8],[25,2,25,4],[25,6,25,8],[20,2,21,8],[14,2,14,4],[14,6,14,8],[15,2,15,4],[15,6,15,8],[16,2,16,4],[16,6,16,8],[17,2,17,4],[17,6,17,8],[18,2,18,4],[18,6,18,8],[19,2,19,4],[11,2,11,4],[11,6,11,8],[12,2,12,4],[12,6,12,8],[13,2,13,4],[13,6,13,8],[10,2,10,8],[2,2,2,8],[3,2,3,4],[3,6,3,8],[4,2,4,4],[4,6,4,8],[5,2,5,4],[5,6,5,8],[6,2,6,4],[6,6,6,8],[7,2,7,4],[7,6,7,8],[8,2,9,8]]}
[]
[]
[null,null,"Lexington Cover-All User Request Form"]
[null,null,"Request Type",null,null,null,"Add User"]
[null,null,"Request Date",null,null,null,{"$f":"'Systems Request'!$Q$10","v":"00:00:00"}]
[null,null,"Request By (Must be user's manager)",null,null,null,{"$f":"Coverall!$D$15","v":0}]
[null,null,"Classic, NexGen or Both",null,null,null,{"$f":"Coverall!$G$15","v":""}]
[null,null,"User Requires Access to Production, Model or Both",null,null,null,{"$f":"Coverall!$H$15","v":""}]
{"$rows_left_out":20}
{"sheet":"Dropdowns","index":13,"n_rows":12,"n_cols":9,"rows_kept":12,"cut":false,"hidden":true,"merged":[]}
["Select Job Function",null,"CVL Role",null,"View Source",null,"Coverall Version",null,"Access to Production, Model or Both"]
["Agency Executive (President/CEO)",null,"Select Role",null,"AIG Claims",null,"Select Coverall Version",null,"Select Access"]
["Operations Manager",null,"View Only",null,"GB Claims",null,"NexGen",null,"Production"]
["IT Manager",null,"Underwriter Assistant",null,"York Claims",null,"Classic",null,"Model"]
["Underwriting Manager",null,"Underwriter PA",null,"Premium Audit",null,"Both",null,"Both"]
["Underwriter",null,"PA Manager",null,"Lex Accounting"]
["Underwriting Assistant",null,"UW Codes",null,"Other"]
[null,null,null,null,"NA"]
{"$rows_left_out":4}